program: Orca
programVersion: 5.0.2
elementType: F F O O O O N C C C C C C C C C C C C C C C C C C C C C C C C C C H H H H H H H H H H H H H H H H H H H H H H H
charge: 0
multiplicity: 1
keywords: wb97x-d3
keywords: def2-TZVPP
keywords: def2/J RIJCOSX
keywords: DEFGRID2
keywords: scfconv7
keywords: smallprint printgap noloewdin
keywords: NOSOSCF
formula: C26H23F2NO4
InChI: InChI=1/C26H23F2NO4/c1-17(2)24(18-11-13-21(14-12-18)32-26(27)28)25(30)33-23(16-29)19-7-6-10-22(15-19)31-20-8-4-3-5-9-20/h3-15,17,23-24,26H,1-2H3
56 atoms
F  -3.439828 -1.298647 1.894599
F  -3.636092 -2.932811 3.296283
O  3.083828 0.550849 -0.041918
O  2.003405 0.433934 -1.995651
O  -1.657302 -2.426767 2.612462
O  -2.264333 2.604103 0.016523
N  4.309972 3.006425 1.788234
C  2.712754 -1.605558 -0.902128
C  2.770642 -2.381695 -2.223389
C  1.528113 -1.940621 -0.013381
C  4.00735 -1.988162 -3.024329
C  2.774967 -3.881233 -1.952919
C  2.577763 -0.11279 -1.092979
C  1.711613 -2.286274 1.321501
C  0.226757 -1.807197 -0.484331
C  2.593447 1.87448 0.178389
C  0.63107 -2.47724 2.165349
C  -0.868704 -1.977743 0.349269
C  -0.65811 -2.30037 1.683363
C  1.218416 1.800803 0.797393
C  0.122198 2.278261 0.095253
C  1.052755 1.176825 2.030377
C  -1.149972 2.115001 0.632742
C  3.562187 2.496997 1.081022
C  -0.219175 1.032843 2.556275
C  -1.326912 1.488862 1.856215
C  -2.952661 -2.522527 2.217945
C  -2.461988 2.433122 -1.324478
C  -3.214472 3.409109 -1.964493
C  -1.999318 1.324407 -2.023131
C  -3.505967 3.273104 -3.313003
C  -2.291012 1.208422 -3.375383
C  -3.042122 2.176474 -4.027013
H  3.62945 -1.805818 -0.338749
H  1.88205 -2.14187 -2.815154
H  4.921099 -2.204965 -2.465696
H  4.021336 -0.929174 -3.2854
H  4.054601 -2.548821 -3.959089
H  2.828962 -4.43706 -2.890319
H  3.637361 -4.172755 -1.348177
H  1.876158 -4.211427 -1.431012
H  2.714077 -2.397772 1.716246
H  0.043844 -1.539965 -1.51786
H  2.5786 2.458775 -0.746334
H  0.787075 -2.735688 3.205199
H  -1.856682 -1.823973 -0.063044
H  0.260723 2.769657 -0.860193
H  1.907845 0.803566 2.58026
H  -0.354952 0.54768 3.513652
H  -2.322798 1.372857 2.26372
H  -3.125234 -3.205873 1.382853
H  -3.572911 4.264482 -1.405444
H  -1.420702 0.553195 -1.530104
H  -4.09493 4.034756 -3.807388
H  -1.927892 0.345792 -3.919091
H  -3.266274 2.076377 -5.080699
elementType: F O N C H
totalener: -1560.11769748 hartree
nucrepener: 3474.08135743 hartree
electener: -5034.19905491 hartree
oneelecener: -9039.08973262 hartree
twoeener: 4004.89067771 hartree
cpcmener: -0.03719328 hartree
kineticenergy: 1553.65147268 hartree
xcener: -146.821058461206 hartree
chargesum: -0.0000000
charge: -0.206542 -0.199243 -0.274243 -0.419759 -0.282972 -0.327779 -0.085950 0.133666 0.057335 -0.035128 -0.294454 -0.309589 0.314200 -0.141343 -0.219351 0.402275 -0.219044 -0.173752 0.280320 0.075317 -0.208913 -0.285644 0.307429 -0.230939 -0.071538 -0.261368 0.389237 0.277770 -0.233488 -0.145127 -0.134778 -0.188393 -0.167817 0.096963 0.046319 0.089494 0.095690 0.093459 0.097765 0.089321 0.098383 0.136909 0.149403 0.135307 0.142066 0.138061 0.146349 0.146598 0.157346 0.141007 0.129918 0.145338 0.133468 0.157139 0.155863 0.157443
qa: -0.2065 -0.1992 -0.2742 -0.4198 -0.2830 -0.3278 -0.0859 0.1337 0.0573 -0.0351 -0.2945 -0.3096 0.3142 -0.1413 -0.2194 0.4023 -0.2190 -0.1738 0.2803 0.0753 -0.2089 -0.2856 0.3074 -0.2309 -0.0715 -0.2614 0.3892 0.2778 -0.2335 -0.1451 -0.1348 -0.1884 -0.1678 0.0970 0.0463 0.0895 0.0957 0.0935 0.0978 0.0893 0.0984 0.1369 0.1494 0.1353 0.1421 0.1381 0.1463 0.1466 0.1573 0.1410 0.1299 0.1453 0.1335 0.1571 0.1559 0.1574
va: 1.0532 1.0800 2.1507 2.0740 2.0552 2.0877 3.1121 3.6691 3.8158 3.5026 3.9243 3.9459 4.2856 3.9466 3.9837 3.7470 3.9718 3.8715 3.7279 3.5228 3.9601 3.9687 3.6892 4.0798 3.8181 3.9857 4.2456 3.7022 3.9782 3.8580 3.9022 3.9426 3.8896 1.0379 1.0263 1.0023 1.0125 1.0044 1.0044 1.0023 1.0009 1.0032 1.0077 1.0195 1.0071 1.0167 1.0091 1.0101 0.9920 1.0181 0.9752 1.0088 0.9918 0.9894 0.9926 0.9903
dispcorr: -0.036240290 hartree
energy: -1560.153937765711
dipole: 18.82685 -19.18142 -0.35458 -10.00632 8.03573 -1.97058 -26.40115 24.94934 -1.45182
magnitude: 2.47320 au
magnitude: 6.28636 debye
