program: Orca
programVersion: 5.0.2
elementType: F F O O O O N C C C C C C C C C C C C C C C C C C C C C C C C C C H H H H H H H H H H H H H H H H H H H H H H H
charge: 0
multiplicity: 1
keywords: wb97x-d3
keywords: def2-TZVPP
keywords: def2/J RIJCOSX
keywords: DEFGRID2
keywords: scfconv7
keywords: smallprint printgap noloewdin
keywords: NOSOSCF
formula: C26H23F2NO4
InChI: InChI=1/C26H23F2NO4/c1-17(2)24(18-11-13-21(14-12-18)32-26(27)28)25(30)33-23(16-29)19-7-6-10-22(15-19)31-20-8-4-3-5-9-20/h3-15,17,23-24,26H,1-2H3
56 atoms
F  -3.423455 -1.305955 1.972869
F  -3.59255 -2.947245 3.369786
O  3.069287 0.552062 -0.038772
O  1.980203 0.467229 -1.989443
O  -1.627513 -2.437782 2.651368
O  -2.275865 2.566652 -0.012653
N  4.305884 2.957416 1.843778
C  2.685601 -1.58989 -0.925867
C  2.721117 -2.35076 -2.256351
C  1.513997 -1.930955 -0.022413
C  3.949406 -1.955371 -3.069273
C  2.720604 -3.853192 -2.002091
C  2.555556 -0.094358 -1.096527
C  1.718622 -2.29394 1.304698
C  0.205526 -1.786632 -0.469648
C  2.585327 1.874363 0.205516
C  0.651765 -2.491589 2.164015
C  -0.876736 -1.963374 0.380013
C  -0.644563 -2.303598 1.706036
C  1.205469 1.796742 0.812599
C  0.114549 2.268324 0.09809
C  1.028992 1.169243 2.042124
C  -1.163318 2.092737 0.617961
C  3.556464 2.470305 1.123489
C  -0.24828 1.017585 2.553054
C  -1.350367 1.465911 1.839671
C  -2.929747 -2.531483 2.280478
C  -2.442352 2.4224 -1.361182
C  -3.205942 3.394923 -1.993116
C  -1.939448 1.342066 -2.076361
C  -3.467548 3.28483 -3.350163
C  -2.201456 1.252214 -3.436649
C  -2.962552 2.217583 -4.080393
H  3.609972 -1.800714 -0.378903
H  1.825984 -2.099868 -2.833597
H  4.869219 -2.186575 -2.526561
H  3.968053 -0.893094 -3.316112
H  3.979435 -2.503385 -4.012179
H  3.584593 -4.154758 -1.404543
H  1.822851 -4.185086 -1.479526
H  2.767986 -4.399327 -2.945542
H  2.727238 -2.414093 1.680724
H  0.006765 -1.504841 -1.496439
H  2.581478 2.477726 -0.707132
H  0.823708 -2.764054 3.197724
H  -1.870912 -1.799839 -0.013197
H  0.262156 2.762631 -0.854336
H  1.879657 0.798782 2.600637
H  -0.392484 0.530929 3.508386
H  -2.350303 1.34241 2.234702
H  -3.118229 -3.210392 1.445076
H  -3.595869 4.227711 -1.421255
H  -1.352317 0.572816 -1.590739
H  -4.065026 4.043738 -3.838441
H  -1.80696 0.41188 -3.993186
H  -3.163367 2.137622 -5.140504
elementType: F O N C H
totalener: -1560.11750935 hartree
nucrepener: 3476.72359007 hartree
electener: -5036.84109942 hartree
oneelecener: -9044.37070905 hartree
twoeener: 4007.52960963 hartree
cpcmener: -0.03700553 hartree
kineticenergy: 1553.65604792 hartree
xcener: -146.822143144714 hartree
chargesum: -0.0000000
charge: -0.206377 -0.199417 -0.273361 -0.419698 -0.283267 -0.327186 -0.085301 0.131794 0.058391 -0.031819 -0.294180 -0.309912 0.314724 -0.143045 -0.228278 0.400749 -0.217025 -0.169658 0.281048 0.078099 -0.217340 -0.289599 0.317828 -0.231509 -0.064049 -0.269488 0.388673 0.281650 -0.234304 -0.147090 -0.134417 -0.189244 -0.167237 0.097273 0.046006 0.089398 0.095455 0.093461 0.089459 0.098412 0.097656 0.136724 0.151135 0.135537 0.141932 0.138593 0.146329 0.145960 0.157399 0.140391 0.130573 0.145218 0.132559 0.157178 0.155848 0.157348
qa: -0.2064 -0.1994 -0.2734 -0.4197 -0.2833 -0.3272 -0.0853 0.1318 0.0584 -0.0318 -0.2942 -0.3099 0.3147 -0.1430 -0.2283 0.4007 -0.2170 -0.1697 0.2810 0.0781 -0.2173 -0.2896 0.3178 -0.2315 -0.0640 -0.2695 0.3887 0.2817 -0.2343 -0.1471 -0.1344 -0.1892 -0.1672 0.0973 0.0460 0.0894 0.0955 0.0935 0.0895 0.0984 0.0977 0.1367 0.1511 0.1355 0.1419 0.1386 0.1463 0.1460 0.1574 0.1404 0.1306 0.1452 0.1326 0.1572 0.1558 0.1573
va: 1.0531 1.0797 2.1505 2.0739 2.0546 2.0900 3.1123 3.6697 3.8154 3.4960 3.9246 3.9462 4.2840 3.9510 3.9885 3.7495 3.9730 3.8669 3.7243 3.5207 3.9618 3.9744 3.6807 4.0793 3.8112 3.9899 4.2449 3.7011 3.9776 3.8579 3.9011 3.9440 3.8901 1.0377 1.0264 1.0022 1.0128 1.0044 1.0023 1.0009 1.0044 1.0032 1.0053 1.0187 1.0073 1.0172 1.0093 1.0103 0.9923 1.0195 0.9752 1.0089 0.9919 0.9894 0.9927 0.9903
dispcorr: -0.036407313 hartree
energy: -1560.153916660430
dipole: 18.56206 -18.93194 -0.36988 -9.70565 7.77736 -1.92829 -27.01197 25.51630 -1.49567
magnitude: 2.46822 au
magnitude: 6.27373 debye
