program: Orca
programVersion: 5.0.2
elementType: F F O O O O N C C C C C C C C C C C C C C C C C C C C C C C C C C H H H H H H H H H H H H H H H H H H H H H H H
charge: 0
multiplicity: 1
keywords: wb97x-d3
keywords: def2-TZVPP
keywords: def2/J RIJCOSX
keywords: DEFGRID2
keywords: scfconv7
keywords: smallprint printgap noloewdin
keywords: NOSOSCF
formula: C26H23F2NO4
InChI: InChI=1/C26H23F2NO4/c1-17(2)24(18-11-13-21(14-12-18)32-26(27)28)25(30)33-23(16-29)19-7-6-10-22(15-19)31-20-8-4-3-5-9-20/h3-15,17,23-24,26H,1-2H3
56 atoms
F  -3.326313 -4.232658 1.00347
F  -3.857734 -2.736497 -0.455381
O  2.614964 0.343996 -0.026324
O  3.879161 -0.583368 1.556527
O  -2.88441 -2.090641 1.454503
O  -1.3525 3.076067 -1.647479
N  2.036905 1.892834 2.955869
C  2.618705 -2.009495 0.056037
C  2.985316 -2.202812 -1.428396
C  1.135197 -2.074175 0.36134
C  4.493347 -2.09047 -1.625942
C  2.483982 -3.55675 -1.913864
C  3.134989 -0.705354 0.621044
C  0.700764 -2.764878 1.487187
C  0.188935 -1.409977 -0.416134
C  2.850769 1.647297 0.479375
C  -0.641973 -2.7994 1.833886
C  -1.154243 -1.425696 -0.076285
C  -1.559752 -2.120402 1.052744
C  2.052328 2.611716 -0.36395
C  0.701935 2.357393 -0.586821
C  2.66005 3.741714 -0.885849
C  -0.041615 3.258553 -1.332996
C  2.40679 1.750883 1.877356
C  1.902763 4.631589 -1.637659
C  0.557775 4.399767 -1.85936
C  -3.750925 -2.954016 0.877779
C  -2.20609 2.337477 -0.873279
C  -2.190122 2.369853 0.515967
C  -3.168448 1.601079 -1.551701
C  -3.141238 1.643793 1.219357
C  -4.124059 0.8958 -0.834669
C  -4.113345 0.910072 0.553072
H  3.118841 -2.797932 0.625223
H  2.503081 -1.423339 -2.025093
H  5.027166 -2.828821 -1.023155
H  4.880926 -1.103866 -1.363211
H  4.75626 -2.265573 -2.670078
H  2.915447 -4.370971 -1.326669
H  1.398591 -3.642928 -1.853672
H  2.765413 -3.716576 -2.955683
H  1.419077 -3.287204 2.107427
H  0.487299 -0.865463 -1.302458
H  3.915395 1.897859 0.444841
H  -0.964813 -3.333634 2.718141
H  -1.867802 -0.876896 -0.676836
H  0.241083 1.466196 -0.179041
H  3.711474 3.929513 -0.709564
H  2.365803 5.517239 -2.051945
H  -0.032767 5.094428 -2.443531
H  -4.72659 -2.839177 1.34572
H  -1.455275 2.954675 1.054602
H  -3.173609 1.591276 -2.634635
H  -3.124368 1.665842 2.301366
H  -4.877919 0.331514 -1.368242
H  -4.856202 0.355662 1.111173
elementType: F O N C H
totalener: -1560.11725850 hartree
nucrepener: 3455.88642802 hartree
electener: -5016.00368651 hartree
oneelecener: -9003.55072172 hartree
twoeener: 3987.54703520 hartree
cpcmener: -0.03846813 hartree
kineticenergy: 1553.65579265 hartree
xcener: -146.820457341196 hartree
chargesum: 0.0000000
charge: -0.212739 -0.214332 -0.267890 -0.409354 -0.333643 -0.319057 -0.087520 0.175103 0.022819 0.014181 -0.295159 -0.296858 0.314434 -0.175053 -0.280075 0.398912 -0.157907 -0.146818 0.215101 -0.000626 -0.255139 -0.203237 0.315301 -0.230321 -0.100416 -0.249235 0.422095 0.313182 -0.210935 -0.247673 -0.137288 -0.115094 -0.196584 0.094455 0.058788 0.094396 0.092024 0.094761 0.091148 0.100574 0.096618 0.138683 0.150286 0.135592 0.147658 0.163117 0.150397 0.145510 0.158216 0.145560 0.127950 0.158197 0.141978 0.157498 0.152446 0.155971
qa: -0.2127 -0.2143 -0.2679 -0.4094 -0.3336 -0.3191 -0.0875 0.1751 0.0228 0.0142 -0.2952 -0.2969 0.3144 -0.1751 -0.2801 0.3989 -0.1579 -0.1468 0.2151 -0.0006 -0.2551 -0.2032 0.3153 -0.2303 -0.1004 -0.2492 0.4221 0.3132 -0.2109 -0.2477 -0.1373 -0.1151 -0.1966 0.0945 0.0588 0.0944 0.0920 0.0948 0.0911 0.1006 0.0966 0.1387 0.1503 0.1356 0.1477 0.1631 0.1504 0.1455 0.1582 0.1456 0.1280 0.1582 0.1420 0.1575 0.1524 0.1560
va: 1.0668 1.0600 2.1481 2.0925 2.0463 2.1057 3.1074 3.6148 3.8440 3.5240 3.9394 3.9270 4.2398 4.0084 3.9940 3.7645 4.0332 3.9441 3.7294 3.7523 3.9628 3.9509 3.7292 4.0220 3.8930 4.0032 4.2382 3.6386 3.8861 3.9769 3.8466 3.8459 3.8568 1.0308 1.0219 1.0035 1.0087 1.0039 1.0021 1.0014 1.0053 1.0041 1.0077 1.0142 1.0025 0.9925 1.0035 1.0029 0.9894 1.0078 0.9764 0.9970 1.0105 0.9912 0.9944 0.9922
dispcorr: -0.035093046 hartree
energy: -1560.152351542601
dipole: 20.22942 -20.17921 0.05021 -1.28000 1.33350 0.05350 -12.84747 10.84387 -2.00360
magnitude: 2.00494 au
magnitude: 5.09616 debye
