program: Gaussian 09
title: 000074840
version: EM64L-G09RevD.01
frameworkgroup: C1[X(C14H19NO4)]
method: RPBEPBE
basis: SDD
operation: Freq
keyword: #p
keyword: freq=noraman
keyword: PBEPBE/SDD
title: #p freq=noraman PBEPBE/SDD
converged: YES YES NO NO
title: Mulliken charges:
elementType: O O O O N C C C C C C C C C C C C C C H H H H H H H H H H H H H H H H H H H
charge: -0.286603 -0.434353 -0.215182 -0.315862 -0.386953 -0.010213 -0.423204 -0.149339 -0.728482 -0.707546 0.156566 0.315811 -0.477223 0.468214 -0.364645 -0.387900 -0.229365 -0.226022 -0.233269 0.192810 0.212922 0.226691 0.286686 0.245027 0.214041 0.213381 0.208385 0.204888 0.244158 0.344620 0.242525 0.220309 0.389376 0.273412 0.232305 0.228388 0.226455 0.229189
chargesum: 0.00000
title: Mulliken charges with hydrogens summed into heavy atoms:
elementType: O O O O N C C C C C C C C C C C C C C
charge: -0.286603 -0.044977 -0.215182 -0.315862 -0.042333 0.182597 0.016409 0.137347 -0.056033 -0.050115 0.156566 0.315811 -0.014389 0.468214 -0.091233 -0.155595 -0.000977 0.000434 -0.004080
polarizability: 1.98514867e+02 -1.68267480e+01 1.47755964e+02 7.68858509e+00 4.74026898e+00 1.57859755e+02
1716.lowfreq: -9.1755 -6.8111 -0.0009 -0.0008 -0.0007 3.6638 16.9650 19.6867 23.2756
frequency: 15.2004 19.6240 23.1894 34.7333 37.6570 59.2676 79.6126 87.0177 118.1833 147.1568 156.5592 194.3375 222.7074 230.1897 254.5582 280.8360 288.1536 330.3408 347.0328 365.6498 387.7478 400.1558 404.0755 481.6526 520.6361 548.9502 576.5596 595.4179 601.9750 605.1500 617.7658 655.5346 684.3090 697.0656 705.0717 756.8970 790.3060 815.8322 828.5816 846.2107 858.2118 883.8590 923.7935 933.8727 950.4553 957.4516 968.6242 981.3018 986.7330 991.3327 998.2844 1000.4951 1027.1987 1068.3301 1090.1842 1093.4508 1122.7024 1155.6031 1173.1784 1188.3079 1200.9985 1203.9695 1221.3419 1240.3238 1241.1192 1260.3325 1294.4206 1309.3873 1317.7026 1330.1251 1342.8241 1349.8211 1357.3731 1383.4605 1385.8297 1403.2377 1442.3825 1448.2728 1460.1078 1461.9402 1482.0611 1484.1113 1484.5684 1492.2343 1500.2214 1594.5209 1614.8408 1647.7161 1669.3639 2951.0957 2970.4918 2977.4825 2982.7413 3035.2735 3035.9918 3063.1763 3065.2238 3068.1695 3070.4177 3094.0894 3108.9113 3118.7864 3127.5761 3139.9401 3151.0746 3164.5032 3526.5361 3564.0936
redmass: 3.6679 4.5725 4.2529 9.0845 4.2700 4.0241 3.6701 4.7663 4.7339 3.9126 6.1454 2.9257 1.9080 2.2124 1.1348 6.2403 5.3235 2.8569 2.8023 2.1701 2.1446 3.5317 2.8223 4.0903 2.9167 4.3552 1.5558 1.6620 3.1212 2.0244 6.2797 4.4476 3.3733 6.5212 2.0368 2.1313 3.3526 3.5079 3.7224 2.4675 1.2515 4.1239 1.2102 1.5068 1.8366 2.1656 1.7932 1.5156 2.7017 4.7660 2.3130 1.3456 2.2077 1.9650 1.5331 2.5539 1.7735 3.0239 1.0541 1.1218 1.9191 2.1170 2.8857 1.1639 1.3446 1.3644 1.6568 1.4368 1.5038 1.2569 1.4096 1.2689 1.3091 1.2116 7.9451 1.2095 2.1792 1.1064 1.1301 1.0451 1.0509 1.0812 2.1570 1.8189 1.0561 6.0968 6.0889 9.2719 9.1295 1.0799 1.0362 1.0473 1.0516 1.0586 1.1008 1.0900 1.0951 1.1000 1.0991 1.0981 1.1073 1.0866 1.0874 1.0920 1.0963 1.1016 1.0643 1.0770
irintensity: 0.1735 0.0998 0.1143 2.2474 0.9868 0.1099 4.1454 4.2166 3.2510 0.3326 0.9315 0.9577 1.2330 6.5526 1.4273 3.6991 3.5451 1.4500 8.5665 1.1249 2.5269 10.4784 0.1271 19.2513 8.6167 18.2801 30.9010 124.0425 13.8322 99.3591 0.3482 13.2051 50.8425 34.5155 65.4622 62.1519 5.3988 9.5620 6.7441 17.2270 0.3230 56.6700 3.1321 16.1144 17.4895 82.4475 2.5443 14.9885 122.4851 38.1713 8.9039 0.7239 3.4039 153.8771 15.0507 94.9548 30.3900 12.2579 0.0730 8.7086 56.8032 156.4186 26.9358 3.1072 48.2140 24.2148 71.4300 2.3045 14.6473 2.2022 4.3402 2.3368 7.0457 21.6176 0.8233 19.8393 9.6479 43.9700 14.7482 5.5469 20.8531 3.5700 7.3522 388.6472 8.5240 1.9561 0.4673 216.1506 212.7834 21.9081 33.6037 40.8536 32.5566 33.1222 16.9301 5.9555 25.4661 33.1520 55.2650 35.0245 6.0520 5.4839 2.4447 20.4429 24.7702 22.4107 32.0325 57.1234
temp: 298.150 k
press: 1.00000 atm
elementType: 8 8 8 8 7 6 6 6 6 6 6 6 6 6 6 6 6 6 6 1 1 1 1 1 1 1 1 1 1 1 1 1 1 1 1 1 1 1
symmnumber: 1
zpe: 813493.3 jmol-1
zpe.correction: 0.309843 hartree
zpe.thermalcorrener: 0.329709 hartree
zpe.thermalcorrenthalpy: 0.330653 hartree
zpe.thermalcorrgfe: 0.257230 hartree
zpe.sumelectzpe: -899.117651 hartree
zpe.sumelectthermal: -899.097786 hartree
zpe.sumelectthermalent: -899.096842 hartree
zpe.sumelectthermalfe: -899.170264 hartree
dipole: -0.2598 0.4981 -2.7240
dipole: 2.7813
quadrupole: -102.5641 -109.9713 -111.3425
quadrupole: -5.2192 -4.6921 -4.1423
quadrupole: 5.3952 -2.0120 -3.3832 -5.2192 -4.6921 -4.1423
hfenergy: -899.4274946 hartree
pointgroup: C01 [X(C14H19N1O4)]
dipole: 0.1788482 -0.4031167 1.0014527 debye
polarizability: 197.1034095|14.0027344|157.5118602|14.5520728|-5.4258026|149.5153159 unknown
InChI: InChI=1S/C14H19NO4/c1-10(2)8-12(13(16)17)15-14(18)19-9-11-6-4-3-5-7-11/h3-7,10,12,15-16H,8-9H2,1-2H3
charge 0 multiplicity 1
38 atoms
O  1.013374 -1.40328 0.851909
O  -1.941942 1.300539 2.794322
O  -3.138538 2.477304 1.186413
O  -0.078202 -0.600367 -1.086891
N  -1.055073 -0.492697 1.047023
C  -3.776715 -1.657501 -0.473883
C  -3.577164 -0.627823 0.676355
C  -2.264316 0.226068 0.637083
C  -3.71487 -0.994658 -1.871656
C  -2.830993 -2.881243 -0.401264
C  -2.491621 1.461607 1.511401
C  -0.05128 -0.79821 0.159807
C  2.211297 -1.751008 0.013003
C  3.201436 -0.608198 -0.057576
C  3.07593 0.388214 -1.060743
C  4.268591 -0.522073 0.87228
C  4.000907 1.453252 -1.127263
C  5.194774 0.542933 0.806335
C  5.062441 1.533028 -0.195106
H  -4.811826 -2.035967 -0.32829
H  -3.625816 -1.146111 1.654805
H  -4.424567 0.08564 0.640979
H  -2.102406 0.585866 -0.393465
H  -2.682309 -0.689746 -2.123599
H  -4.368339 -0.103518 -1.92965
H  -4.04448 -1.707542 -2.649808
H  -3.166815 -3.662442 -1.108838
H  -2.815852 -3.324865 0.611764
H  -1.798605 -2.608474 -0.677486
H  -0.885714 -0.643537 2.042967
H  1.848223 -2.036167 -0.989362
H  2.630107 -2.625116 0.536102
H  -2.136384 2.105703 3.345245
H  2.244338 0.326277 -1.771628
H  4.37228 -1.290069 1.649016
H  3.896579 2.21809 -1.904955
H  6.017256 0.599136 1.528234
H  5.781596 2.358256 -0.249483
