program: Orca
programVersion: 5.0.2
elementType: F F O O O O N C C C C C C C C C C C C C C C C C C C C C C C C C C H H H H H H H H H H H H H H H H H H H H H H H
charge: 0
multiplicity: 1
keywords: wb97x-d3
keywords: def2-TZVPP
keywords: def2/J RIJCOSX
keywords: DEFGRID2
keywords: scfconv7
keywords: smallprint printgap noloewdin
keywords: NOSOSCF
formula: C26H23F2NO4
InChI: InChI=1/C26H23F2NO4/c1-17(2)24(18-11-13-21(14-12-18)32-26(27)28)25(30)33-23(16-29)19-7-6-10-22(15-19)31-20-8-4-3-5-9-20/h3-15,17,23-24,26H,1-2H3
56 atoms
F  -4.42338 -2.06833 0.94428
F  -3.162194 -0.634882 1.956641
O  3.446089 0.37355 0.429038
O  3.545339 -0.083784 -1.764127
O  -2.440956 -1.751587 0.169537
O  -1.496841 1.410846 -1.217305
N  4.628046 3.19986 1.713558
C  3.218402 -1.88218 -0.178871
C  3.836935 -2.921271 -1.121166
C  1.70524 -1.9324 -0.051188
C  5.357848 -2.804367 -1.114099
C  3.416214 -4.328193 -0.71459
C  3.45891 -0.458247 -0.626481
C  1.09539 -1.777309 1.185922
C  0.891274 -2.020285 -1.17979
C  3.077046 1.736308 0.208359
C  -0.287048 -1.713687 1.315928
C  -0.485226 -1.976892 -1.069331
C  -1.074041 -1.818604 0.178942
C  1.614802 1.872832 0.55175
C  0.687842 1.692201 -0.465356
C  1.192061 2.03637 1.865742
C  -0.669293 1.662955 -0.167965
C  3.947989 2.547194 1.057841
C  -0.164679 2.021821 2.145418
C  -1.102469 1.827022 1.142447
C  -3.156889 -1.830843 1.318122
C  -2.828686 1.729951 -1.178618
C  -3.278424 2.979486 -0.771104
C  -3.719846 0.771981 -1.640086
C  -4.638126 3.253381 -0.806848
C  -5.075294 1.06426 -1.682628
C  -5.541569 2.300292 -1.257972
H  3.650096 -2.015284 0.817935
H  3.483387 -2.737124 -2.139808
H  5.801799 -3.529695 -1.797645
H  5.760683 -3.002223 -0.117955
H  5.706364 -1.817748 -1.422925
H  3.713138 -4.548143 0.313774
H  2.338665 -4.477771 -0.787853
H  3.890927 -5.069256 -1.359566
H  1.703335 -1.690015 2.078038
H  1.327168 -2.126027 -2.165319
H  3.26378 2.036057 -0.826976
H  -0.707486 -1.564696 2.301348
H  -1.107001 -2.055207 -1.952098
H  1.013165 1.561588 -1.490736
H  1.904837 2.17588 2.669065
H  -0.503837 2.150787 3.16479
H  -2.153551 1.80793 1.393206
H  -2.820322 -2.604684 2.013194
H  -2.58264 3.736385 -0.431195
H  -3.354073 -0.188838 -1.976979
H  -4.989804 4.224857 -0.484407
H  -5.767838 0.315637 -2.045173
H  -6.600222 2.522194 -1.28445
elementType: F O N C H
totalener: -1560.11714880 hartree
nucrepener: 3492.86086183 hartree
electener: -5052.97801063 hartree
oneelecener: -9077.33210301 hartree
twoeener: 4024.35409238 hartree
cpcmener: -0.03591606 hartree
kineticenergy: 1553.64634034 hartree
xcener: -146.821249303422 hartree
chargesum: 0.0000000
charge: -0.204282 -0.211403 -0.274596 -0.415030 -0.287355 -0.319114 -0.086334 0.124622 0.058169 0.013533 -0.296458 -0.305148 0.321223 -0.246719 -0.183666 0.377650 -0.165894 -0.223519 0.288861 0.048764 -0.288892 -0.204063 0.373156 -0.221228 -0.131934 -0.236347 0.395858 0.312497 -0.208314 -0.266066 -0.144444 -0.123566 -0.177194 0.098597 0.044669 0.093795 0.089434 0.095668 0.090448 0.098558 0.096371 0.138212 0.144144 0.135037 0.138913 0.149003 0.131212 0.136054 0.159378 0.144742 0.147627 0.157067 0.145391 0.158313 0.157093 0.157506
qa: -0.2043 -0.2114 -0.2746 -0.4150 -0.2874 -0.3191 -0.0863 0.1246 0.0582 0.0135 -0.2965 -0.3051 0.3212 -0.2467 -0.1837 0.3777 -0.1659 -0.2235 0.2889 0.0488 -0.2889 -0.2041 0.3732 -0.2212 -0.1319 -0.2363 0.3959 0.3125 -0.2083 -0.2661 -0.1444 -0.1236 -0.1772 0.0986 0.0447 0.0938 0.0894 0.0957 0.0904 0.0986 0.0964 0.1382 0.1441 0.1350 0.1389 0.1490 0.1312 0.1361 0.1594 0.1447 0.1476 0.1571 0.1454 0.1583 0.1571 0.1575
va: 1.0779 1.0560 2.1271 2.0836 2.0784 2.0572 3.1102 3.6609 3.8111 3.5103 3.9322 3.9440 4.2737 4.0321 3.9583 3.7629 3.8411 3.9749 3.7284 3.6300 4.0068 3.9770 3.5561 4.0715 3.9278 3.9134 4.2209 3.6474 3.9224 3.9663 3.8870 3.9034 3.9072 1.0335 1.0284 1.0038 1.0024 1.0114 1.0022 1.0016 1.0046 1.0103 1.0086 1.0257 1.0139 1.0019 1.0295 1.0115 0.9908 1.0168 0.9733 0.9971 1.0141 0.9902 0.9910 0.9903
dispcorr: -0.036947502 hartree
energy: -1560.154096302640
dipole: 19.25007 -20.39677 -1.14670 -13.33036 11.65092 -1.67944 -7.84694 8.36183 0.51489
magnitude: 2.09775 au
magnitude: 5.33205 debye
