program: Orca
programVersion: 5.0.2
elementType: F F O O O O N C C C C C C C C C C C C C C C C C C C C C C C C C C H H H H H H H H H H H H H H H H H H H H H H H
charge: 0
multiplicity: 1
keywords: wb97x-d3
keywords: def2-TZVPP
keywords: def2/J RIJCOSX
keywords: DEFGRID2
keywords: scfconv7
keywords: smallprint printgap noloewdin
keywords: NOSOSCF
formula: C26H23F2NO4
InChI: InChI=1/C26H23F2NO4/c1-17(2)24(18-11-13-21(14-12-18)32-26(27)28)25(30)33-23(16-29)19-7-6-10-22(15-19)31-20-8-4-3-5-9-20/h3-15,17,23-24,26H,1-2H3
56 atoms
F  -4.283052 -2.621164 0.25192
F  -3.229884 -4.129624 -0.881828
O  2.735161 0.524923 0.973657
O  3.608357 -0.117204 -0.977386
O  -2.904793 -1.981963 -1.39873
O  -1.652215 2.391094 -0.960006
N  2.80622 3.223511 2.869333
C  2.472578 -1.740848 0.417832
C  3.306446 -2.90265 -0.14748
C  1.028278 -1.761084 -0.042678
C  4.71595 -2.884804 0.435893
C  2.63181 -4.236235 0.153262
C  3.029944 -0.390297 0.039645
C  0.005485 -2.014008 0.862994
C  0.692409 -1.56353 -1.379963
C  2.979044 1.883063 0.634008
C  -1.319787 -2.099621 0.459926
C  -0.623316 -1.652758 -1.800134
C  -1.625424 -1.933595 -0.882971
C  1.96232 2.4173 -0.348973
C  0.616547 2.115593 -0.167624
C  2.377612 3.221344 -1.398291
C  -0.319125 2.651866 -1.041386
C  2.886537 2.616791 1.897642
C  1.430531 3.738974 -2.271674
C  0.085655 3.465535 -2.09481
C  -3.798199 -2.909419 -0.983444
C  -2.255356 2.095006 0.233579
C  -1.976983 2.791341 1.403923
C  -3.226427 1.104427 0.211693
C  -2.671291 2.469944 2.561351
C  -3.921561 0.802327 1.373797
C  -3.642852 1.477473 2.553951
H  2.478056 -1.816652 1.509754
H  3.371308 -2.78789 -1.233888
H  5.306599 -3.710384 0.036591
H  4.689772 -2.995506 1.522516
H  5.256999 -1.965649 0.208923
H  3.254629 -5.061854 -0.193681
H  2.476799 -4.370371 1.226625
H  1.663114 -4.332867 -0.337521
H  0.239697 -2.158582 1.910567
H  1.457627 -1.354427 -2.117128
H  3.993293 2.021371 0.245911
H  -2.080357 -2.286056 1.204548
H  -0.873401 -1.508186 -2.843673
H  0.305627 1.472617 0.64685
H  3.428479 3.443215 -1.53404
H  1.742332 4.365753 -3.096562
H  -0.654324 3.874061 -2.771736
H  -4.62592 -2.938036 -1.690038
H  -1.231337 3.576582 1.421936
H  -3.442435 0.585139 -0.712938
H  -2.452216 3.008425 3.474529
H  -4.679295 0.029715 1.353865
H  -4.181575 1.23576 3.46068
elementType: F O N C H
totalener: -1560.11838289 hartree
nucrepener: 3462.44984029 hartree
electener: -5022.56822318 hartree
oneelecener: -9016.88977105 hartree
twoeener: 3994.32154787 hartree
cpcmener: -0.03474819 hartree
kineticenergy: 1553.64185975 hartree
xcener: -146.816784951951 hartree
chargesum: -0.0000000
charge: -0.214955 -0.210272 -0.279978 -0.417871 -0.325251 -0.326960 -0.086526 0.133303 0.066078 -0.053652 -0.292994 -0.313899 0.323733 -0.164267 -0.157892 0.398109 -0.171443 -0.209488 0.248453 0.070581 -0.278549 -0.213181 0.312357 -0.229631 -0.101573 -0.254187 0.430940 0.321498 -0.208525 -0.273713 -0.139032 -0.124986 -0.181090 0.095054 0.045848 0.093513 0.089196 0.095237 0.099302 0.089713 0.097504 0.138302 0.140818 0.144970 0.143638 0.146483 0.144677 0.144246 0.158972 0.146927 0.134473 0.155197 0.150197 0.159998 0.152672 0.157928
qa: -0.2150 -0.2103 -0.2800 -0.4179 -0.3253 -0.3270 -0.0865 0.1333 0.0661 -0.0537 -0.2930 -0.3139 0.3237 -0.1643 -0.1579 0.3981 -0.1714 -0.2095 0.2485 0.0706 -0.2785 -0.2132 0.3124 -0.2296 -0.1016 -0.2542 0.4309 0.3215 -0.2085 -0.2737 -0.1390 -0.1250 -0.1811 0.0951 0.0458 0.0935 0.0892 0.0952 0.0993 0.0897 0.0975 0.1383 0.1408 0.1450 0.1436 0.1465 0.1447 0.1442 0.1590 0.1469 0.1345 0.1552 0.1502 0.1600 0.1527 0.1579
va: 1.0614 1.0727 2.1435 2.0803 2.0648 2.0755 3.1099 3.7002 3.8023 3.4808 3.9273 3.9551 4.2456 3.9534 3.9226 3.7360 3.9460 4.0353 3.6548 3.5661 3.9475 3.9851 3.6685 4.0840 3.8898 4.0231 4.2314 3.6499 3.9164 3.9609 3.8896 3.8609 3.9199 1.0386 1.0278 1.0046 1.0020 1.0127 1.0050 1.0019 0.9999 1.0049 1.0184 1.0164 1.0234 1.0046 1.0109 1.0028 0.9889 1.0067 0.9743 0.9981 1.0169 0.9893 1.0038 0.9905
dispcorr: -0.034969739 hartree
energy: -1560.153352631333
dipole: 21.54116 -21.70542 -0.16426 -6.43008 5.51613 -0.91395 2.13880 -3.05214 -0.91335
magnitude: 1.30249 au
magnitude: 3.31068 debye
