program: Orca
programVersion: 5.0.2
elementType: F F O O O O N C C C C C C C C C C C C C C C C C C C C C C C C C C H H H H H H H H H H H H H H H H H H H H H H H
charge: 0
multiplicity: 1
keywords: wb97x-d3
keywords: def2-TZVPP
keywords: def2/J RIJCOSX
keywords: DEFGRID2
keywords: scfconv7
keywords: smallprint printgap noloewdin
keywords: NOSOSCF
formula: C26H23F2NO4
InChI: InChI=1/C26H23F2NO4/c1-17(2)24(18-11-13-21(14-12-18)32-26(27)28)25(30)33-23(16-29)19-7-6-10-22(15-19)31-20-8-4-3-5-9-20/h3-15,17,23-24,26H,1-2H3
56 atoms
F  -4.755689 -1.719799 -0.316443
F  -3.480141 -3.192051 -1.248259
O  3.230567 0.476217 0.460677
O  3.684315 -0.614532 -1.446946
O  -2.741969 -1.917636 0.423391
O  -1.436539 1.690195 -1.106163
N  5.268015 3.051287 0.903523
C  2.933149 -1.845757 0.497851
C  3.587757 -3.140396 -0.005191
C  1.416674 -1.848247 0.439607
C  5.101862 -3.080107 0.169592
C  3.022794 -4.343931 0.739502
C  3.356139 -0.630116 -0.291758
C  0.742049 -2.086007 -0.751957
C  0.66268 -1.593248 1.580401
C  3.27473 1.752286 -0.173398
C  -0.644712 -2.108324 -0.810003
C  -0.721078 -1.603473 1.541649
C  -1.375769 -1.874332 0.34768
C  1.930331 2.418972 0.001362
C  0.84188 1.800089 -0.605479
C  1.746774 3.570207 0.751838
C  -0.426889 2.334191 -0.456247
C  4.382845 2.488369 0.436266
C  0.471275 4.10713 0.874403
C  -0.619808 3.501838 0.276159
C  -3.494208 -1.948356 -0.707117
C  -2.702728 1.676408 -0.584097
C  -2.942976 1.449717 0.765362
C  -3.754233 1.832816 -1.475412
C  -4.252568 1.394897 1.218637
C  -5.059468 1.763119 -1.00896
C  -5.31469 1.552368 0.338461
H  3.227562 -1.695052 1.541234
H  3.363532 -3.259146 -1.069587
H  5.560178 -2.264639 -0.391179
H  5.564908 -4.005675 -0.176002
H  5.36971 -2.952323 1.221218
H  1.953081 -4.471916 0.571816
H  3.515141 -5.259879 0.409271
H  3.182403 -4.25465 1.816926
H  1.294113 -2.276131 -1.664386
H  1.160032 -1.391602 2.52123
H  3.504234 1.647818 -1.238427
H  -1.115247 -2.329047 -1.758264
H  -1.294708 -1.414099 2.440123
H  0.9689 0.905443 -1.204159
H  2.578888 4.061627 1.239237
H  0.326269 5.013512 1.447098
H  -1.603874 3.940569 0.379217
H  -3.198528 -1.22483 -1.470846
H  -2.123839 1.311986 1.459853
H  -3.550583 2.004005 -2.525103
H  -4.440315 1.217914 2.269685
H  -5.878762 1.883448 -1.705955
H  -6.333445 1.503042 0.69927
elementType: F O N C H
totalener: -1560.11946934 hartree
nucrepener: 3447.10160206 hartree
electener: -5007.22107140 hartree
oneelecener: -8984.89066451 hartree
twoeener: 3977.66959311 hartree
cpcmener: -0.03506083 hartree
kineticenergy: 1553.63309419 hartree
xcener: -146.817415119095 hartree
chargesum: -0.0000000
charge: -0.193994 -0.210358 -0.272541 -0.421604 -0.269274 -0.328074 -0.083648 0.130162 0.058657 -0.035455 -0.292230 -0.310781 0.344887 -0.242773 -0.136082 0.425916 -0.144477 -0.227819 0.264128 -0.026656 -0.264193 -0.175797 0.263261 -0.239717 -0.129454 -0.188688 0.378598 0.351005 -0.226250 -0.300580 -0.120536 -0.081597 -0.208990 0.097549 0.046092 0.095099 0.092525 0.089150 0.098356 0.097500 0.089731 0.141626 0.138351 0.142383 0.137354 0.145214 0.157152 0.136558 0.160612 0.155405 0.126351 0.154849 0.144079 0.156488 0.156753 0.155775
qa: -0.1940 -0.2104 -0.2725 -0.4216 -0.2693 -0.3281 -0.0836 0.1302 0.0587 -0.0355 -0.2922 -0.3108 0.3449 -0.2428 -0.1361 0.4259 -0.1445 -0.2278 0.2641 -0.0267 -0.2642 -0.1758 0.2633 -0.2397 -0.1295 -0.1887 0.3786 0.3510 -0.2262 -0.3006 -0.1205 -0.0816 -0.2090 0.0975 0.0461 0.0951 0.0925 0.0891 0.0984 0.0975 0.0897 0.1416 0.1384 0.1424 0.1374 0.1452 0.1572 0.1366 0.1606 0.1554 0.1264 0.1548 0.1441 0.1565 0.1568 0.1558
va: 1.0764 1.0601 2.1348 2.0800 2.0458 2.0435 3.1134 3.6630 3.8127 3.4862 3.9264 3.9500 4.2448 4.0001 3.9491 3.7094 3.9125 3.9639 3.7487 3.8373 4.0000 3.9289 3.7680 4.0818 3.9373 3.9222 4.2635 3.5022 3.8755 4.0230 3.8836 3.8338 3.9132 1.0369 1.0263 1.0135 1.0046 1.0021 1.0002 1.0048 1.0022 1.0170 1.0031 1.0269 1.0155 1.0058 1.0079 1.0154 0.9911 0.9967 0.9693 0.9974 1.0100 0.9909 0.9884 0.9914
dispcorr: -0.035528911 hartree
energy: -1560.154998250435
dipole: 19.02145 -20.28054 -1.25908 -7.77967 7.78874 0.00907 6.01400 -5.85330 0.16071
magnitude: 1.26933 au
magnitude: 3.22638 debye
