program: Orca
programVersion: 5.0.2
elementType: F F O O O O N C C C C C C C C C C C C C C C C C C C C C C C C C C H H H H H H H H H H H H H H H H H H H H H H H
charge: 0
multiplicity: 1
keywords: wb97x-d3
keywords: def2-TZVPP
keywords: def2/J RIJCOSX
keywords: DEFGRID2
keywords: scfconv7
keywords: smallprint printgap noloewdin
keywords: NOSOSCF
formula: C26H23F2NO4
InChI: InChI=1/C26H23F2NO4/c1-17(2)24(18-11-13-21(14-12-18)32-26(27)28)25(30)33-23(16-29)19-7-6-10-22(15-19)31-20-8-4-3-5-9-20/h3-15,17,23-24,26H,1-2H3
56 atoms
F  -3.648827 -1.437568 1.896231
F  -3.511839 -3.409658 1.015338
O  3.280451 0.306686 0.698805
O  3.430219 0.007973 -1.509607
O  -2.876875 -1.645258 -0.197985
O  -1.45692 1.820801 0.703169
N  4.094935 2.671312 2.842575
C  2.800242 -1.852595 -0.090749
C  3.408437 -2.893538 -1.042723
C  1.283718 -1.823434 -0.094206
C  4.929371 -2.903337 -0.926487
C  2.848518 -4.276716 -0.733346
C  3.227642 -0.441463 -0.414207
C  0.567472 -2.06114 1.070028
C  0.570145 -1.535486 -1.255567
C  3.378835 1.711595 0.520942
C  -0.821711 -2.020256 1.09995
C  -0.81191 -1.501275 -1.248214
C  -1.510975 -1.737927 -0.070791
C  2.064836 2.317801 0.080523
C  0.870803 1.794027 0.55788
C  2.061928 3.399032 -0.787989
C  -0.330398 2.360571 0.160184
C  3.775283 2.235522 1.829595
C  0.852595 3.969863 -1.158564
C  -0.348113 3.462598 -0.687499
C  -3.748033 -2.109802 0.724242
C  -2.611973 1.686047 -0.013886
C  -3.78977 1.695118 0.721447
C  -2.636544 1.472268 -1.386677
C  -4.998863 1.477808 0.079149
C  -3.855443 1.263059 -2.016108
C  -5.039499 1.260937 -1.291838
H  3.130164 -2.085549 0.926325
H  3.137094 -2.633361 -2.070434
H  5.243328 -3.156357 0.089078
H  5.38002 -1.943313 -1.182637
H  5.360706 -3.647587 -1.597664
H  3.311383 -5.027531 -1.375486
H  3.047972 -4.562304 0.302626
H  1.771175 -4.334042 -0.891672
H  1.096509 -2.282118 1.989178
H  1.088115 -1.336447 -2.185572
H  4.171705 1.972517 -0.187899
H  -1.316732 -2.204308 2.041879
H  -1.354806 -1.287953 -2.160032
H  0.854835 0.951979 1.239301
H  2.993958 3.796825 -1.169134
H  0.841868 4.822477 -1.824682
H  -1.281701 3.924971 -0.981273
H  -4.756834 -1.998988 0.330518
H  -3.755016 1.862165 1.790766
H  -1.723335 1.451176 -1.966913
H  -5.914219 1.482317 0.656913
H  -3.872716 1.091922 -3.084822
H  -5.984705 1.093074 -1.791067
elementType: F O N C H
totalener: -1560.11826718 hartree
nucrepener: 3491.57992788 hartree
electener: -5051.69819506 hartree
oneelecener: -9075.20132620 hartree
twoeener: 4023.50313114 hartree
cpcmener: -0.03573400 hartree
kineticenergy: 1553.65289922 hartree
xcener: -146.822523110161 hartree
chargesum: 0.0000000
charge: -0.216779 -0.213873 -0.277563 -0.418159 -0.302780 -0.322315 -0.084847 0.137245 0.062219 -0.049449 -0.292319 -0.312471 0.318806 -0.222031 -0.149930 0.383637 -0.132329 -0.226231 0.264601 0.054596 -0.264375 -0.201707 0.269267 -0.231455 -0.121016 -0.204640 0.435801 0.401259 -0.311468 -0.259401 -0.102042 -0.131833 -0.199849 0.093633 0.046699 0.089090 0.095202 0.093394 0.098318 0.089605 0.098100 0.137485 0.139994 0.145510 0.135316 0.147130 0.150486 0.143771 0.160264 0.159285 0.132684 0.140355 0.154429 0.156186 0.157357 0.157136
qa: -0.2168 -0.2139 -0.2776 -0.4182 -0.3028 -0.3223 -0.0848 0.1372 0.0622 -0.0494 -0.2923 -0.3125 0.3188 -0.2220 -0.1499 0.3836 -0.1323 -0.2262 0.2646 0.0546 -0.2644 -0.2017 0.2693 -0.2315 -0.1210 -0.2046 0.4358 0.4013 -0.3115 -0.2594 -0.1020 -0.1318 -0.1998 0.0936 0.0467 0.0891 0.0952 0.0934 0.0983 0.0896 0.0981 0.1375 0.1400 0.1455 0.1353 0.1471 0.1505 0.1438 0.1603 0.1593 0.1327 0.1404 0.1544 0.1562 0.1574 0.1571
va: 1.0550 1.0732 2.1385 2.0789 2.1049 2.0560 3.1137 3.6820 3.8080 3.4925 3.9256 3.9518 4.2469 4.0011 3.9475 3.7371 3.9483 3.9890 3.7075 3.6173 4.0374 3.9925 3.7672 4.0804 3.8879 3.9337 4.2278 3.4594 4.0002 3.8792 3.8349 3.8954 3.9141 1.0397 1.0260 1.0022 1.0122 1.0044 1.0047 1.0021 1.0002 1.0065 1.0188 1.0159 1.0305 1.0018 1.0131 1.0021 0.9900 0.9949 0.9765 1.0132 0.9987 0.9894 0.9909 0.9907
dispcorr: -0.036654899 hartree
energy: -1560.154922076352
dipole: 17.60237 -18.58814 -0.98578 -8.60099 8.00360 -0.59739 -14.99951 13.20375 -1.79576
magnitude: 2.13387 au
magnitude: 5.42385 debye
