program: Orca
programVersion: 5.0.2
elementType: F F O O O O N C C C C C C C C C C C C C C C C C C C C C C C C C C H H H H H H H H H H H H H H H H H H H H H H H
charge: 0
multiplicity: 1
keywords: wb97x-d3
keywords: def2-TZVPP
keywords: def2/J RIJCOSX
keywords: DEFGRID2
keywords: scfconv7
keywords: smallprint printgap noloewdin
keywords: NOSOSCF
formula: C26H23F2NO4
InChI: InChI=1/C26H23F2NO4/c1-17(2)24(18-11-13-21(14-12-18)32-26(27)28)25(30)33-23(16-29)19-7-6-10-22(15-19)31-20-8-4-3-5-9-20/h3-15,17,23-24,26H,1-2H3
56 atoms
F  -3.437337 -1.918952 2.335302
F  -3.230126 -3.694544 3.550678
O  2.986767 0.582585 -0.032254
O  1.834654 0.588598 -1.951598
O  -1.427096 -2.748532 2.826973
O  -2.335475 2.605027 -0.183429
N  4.146183 2.825754 2.090663
C  2.569081 -1.512719 -1.002231
C  2.495945 -2.22233 -2.359047
C  1.480603 -1.911134 -0.023067
C  3.646434 -1.790241 -3.263108
C  2.517339 -3.734167 -2.161712
C  2.432297 -0.009099 -1.102232
C  1.798051 -2.394977 1.24069
C  0.139571 -1.726504 -0.335379
C  2.49937 1.883168 0.296476
C  0.810857 -2.693494 2.162473
C  -0.863452 -1.998923 0.5819
C  -0.521291 -2.484718 1.836184
C  1.087262 1.776892 0.819192
C  0.045679 2.305663 0.073637
C  0.832069 1.063005 1.984242
C  -1.265917 2.096931 0.48495
C  3.426658 2.401436 1.302812
C  -0.47684 0.878021 2.392759
C  -1.528867 1.379752 1.642786
C  -2.710332 -3.047482 2.505144
C  -2.36061 2.673914 -1.546323
C  -3.100822 3.711422 -2.097399
C  -1.73911 1.741831 -2.3687
C  -3.221466 3.812489 -3.473543
C  -1.858785 1.863888 -3.744862
C  -2.598123 2.893875 -4.305474
H  3.536825 -1.741219 -0.542678
H  1.555809 -1.94759 -2.846472
H  3.625685 -0.723593 -3.482136
H  3.60265 -2.316247 -4.217194
H  4.611591 -2.024628 -2.807667
H  3.432026 -4.051433 -1.655135
H  1.672645 -4.085982 -1.570267
H  2.48401 -4.245905 -3.123867
H  2.835636 -2.541841 1.513655
H  -0.141568 -1.332894 -1.304074
H  2.537027 2.546814 -0.573133
H  1.067356 -3.075159 3.141921
H  -1.887481 -1.776759 0.315618
H  0.255451 2.855585 -0.834924
H  1.64535 0.647659 2.565002
H  -0.686568 0.319118 3.2945
H  -2.553567 1.21935 1.951067
H  -2.802382 -3.658738 1.600584
H  -3.581169 4.427741 -1.443983
H  -1.153799 0.933183 -1.951897
H  -3.801661 4.621829 -3.896601
H  -1.363817 1.141807 -4.380553
H  -2.687425 2.980528 -5.379655
totalener: -1560.09038027 hartree
nucrepener: 3452.69644111 hartree
electener: -5012.78682138 hartree
oneelecener: -8995.83716417 hartree
twoeener: 3983.05034279 hartree
kineticenergy: 1553.72281643 hartree
xcener: -146.830746586956 hartree
chargesum: 0.0000000
charge: -0.190233 -0.174496 -0.253002 -0.350712 -0.257990 -0.294689 0.001053 0.073162 0.056404 -0.023757 -0.276985 -0.280705 0.281459 -0.114241 -0.200088 0.316046 -0.177801 -0.126811 0.213124 0.092843 -0.213031 -0.249793 0.296244 -0.265879 -0.052243 -0.240180 0.374483 0.264346 -0.209404 -0.139474 -0.095207 -0.137778 -0.135079 0.088557 0.043756 0.102513 0.084792 0.082547 0.080226 0.098770 0.090948 0.109970 0.122949 0.119602 0.130359 0.129273 0.126967 0.120593 0.135917 0.132334 0.088489 0.125753 0.099935 0.125830 0.125179 0.125159
qa: -0.1902 -0.1745 -0.2530 -0.3507 -0.2580 -0.2947 0.0011 0.0732 0.0564 -0.0238 -0.2770 -0.2807 0.2815 -0.1142 -0.2001 0.3160 -0.1778 -0.1268 0.2131 0.0928 -0.2130 -0.2498 0.2962 -0.2659 -0.0522 -0.2402 0.3745 0.2643 -0.2094 -0.1395 -0.0952 -0.1378 -0.1351 0.0886 0.0438 0.1025 0.0848 0.0825 0.0802 0.0988 0.0909 0.1100 0.1229 0.1196 0.1304 0.1293 0.1270 0.1206 0.1359 0.1323 0.0885 0.1258 0.0999 0.1258 0.1252 0.1252
va: 1.0754 1.1133 2.1533 2.1367 2.0755 2.1272 3.1191 3.7395 3.8247 3.5564 3.9279 3.9460 4.3025 3.9855 4.0429 3.8413 4.0189 3.8499 3.8382 3.5420 3.9747 4.0280 3.8026 4.0366 3.8554 4.0211 4.2985 3.7936 4.0261 3.9100 3.9419 3.9843 3.9523 1.0367 1.0243 1.0148 1.0072 1.0039 1.0049 1.0037 1.0075 1.0099 1.0177 1.0173 1.0103 1.0188 1.0137 1.0192 0.9985 1.0166 0.9846 1.0149 1.0113 0.9988 1.0007 1.0003
dispcorr: -0.036043508 hartree
energy: -1560.126423782195
dipole: 17.52784 -17.83808 -0.31024 -5.73316 4.45257 -1.28058 -29.48428 28.11997 -1.36431
magnitude: 1.89670 au
magnitude: 4.82103 debye
