program: Orca
programVersion: 5.0.2
elementType: F F O O O O N C C C C C C C C C C C C C C C C C C C C C C C C C C H H H H H H H H H H H H H H H H H H H H H H H
charge: 0
multiplicity: 1
keywords: wb97x-d3
keywords: def2-TZVPP
keywords: def2/J RIJCOSX
keywords: DEFGRID2
keywords: scfconv7
keywords: smallprint printgap noloewdin
keywords: NOSOSCF
formula: C26H23F2NO4
InChI: InChI=1/C26H23F2NO4/c1-17(2)24(18-11-13-21(14-12-18)32-26(27)28)25(30)33-23(16-29)19-7-6-10-22(15-19)31-20-8-4-3-5-9-20/h3-15,17,23-24,26H,1-2H3
56 atoms
F  -3.583344 -1.702467 2.023469
F  -3.488118 -3.429751 3.321426
O  3.133217 0.567276 -0.016483
O  2.005877 0.515241 -1.949784
O  -1.623711 -2.511025 2.716766
O  -2.128611 2.82179 -0.116707
N  4.367863 2.903361 1.958414
C  2.654499 -1.55976 -0.88855
C  2.623186 -2.332448 -2.212855
C  1.497907 -1.873574 0.042789
C  3.81187 -1.9614 -3.094269
C  2.612722 -3.83326 -1.943709
C  2.573187 -0.059108 -1.06461
C  1.715147 -2.32104 1.340803
C  0.18737 -1.647526 -0.359261
C  2.679243 1.895578 0.239785
C  0.659248 -2.550589 2.20573
C  -0.88172 -1.8465 0.499466
C  -0.640576 -2.305589 1.78717
C  1.274629 1.847421 0.791073
C  0.230776 2.409076 0.074975
C  1.025953 1.155377 1.972055
C  -1.0725 2.260279 0.536421
C  3.629834 2.452086 1.203352
C  -0.273195 1.023448 2.425505
C  -1.329017 1.562909 1.705113
C  -2.877924 -2.823057 2.30036
C  -2.358671 2.553931 -1.4335
C  -3.24582 3.405849 -2.081142
C  -1.791393 1.484515 -2.115044
C  -3.564947 3.183137 -3.409304
C  -2.115906 1.280679 -3.44911
C  -3.000924 2.121391 -4.103443
H  3.587496 -1.798602 -0.366977
H  1.705988 -2.069037 -2.747974
H  4.756965 -2.176859 -2.590165
H  3.809601 -0.908917 -3.374588
H  3.798719 -2.540478 -4.018105
H  3.514286 -4.142696 -1.409504
H  1.752725 -4.141632 -1.349866
H  2.584051 -4.389064 -2.881218
H  2.726615 -2.497091 1.685495
H  -0.015315 -1.282028 -1.358027
H  2.715673 2.505674 -0.668149
H  0.838467 -2.908565 3.211038
H  -1.877084 -1.594369 0.16036
H  0.423475 2.939754 -0.849394
H  1.841392 0.716373 2.532064
H  -0.473214 0.480576 3.339067
H  -2.348996 1.447199 2.047043
H  -2.893375 -3.469768 1.416309
H  -3.681208 4.23335 -1.536709
H  -1.092493 0.819786 -1.625998
H  -4.257514 3.849526 -3.906219
H  -1.664128 0.451532 -3.977592
H  -3.24779 1.954116 -5.142847
totalener: -1560.09018172 hartree
nucrepener: 3463.54613205 hartree
electener: -5023.63631376 hartree
oneelecener: -9017.42536788 hartree
twoeener: 3993.78905412 hartree
kineticenergy: 1553.71632742 hartree
xcener: -146.829005661393 hartree
chargesum: 0.0000000
charge: -0.189212 -0.174546 -0.255578 -0.346213 -0.258425 -0.297448 0.002102 0.076315 0.048790 -0.024204 -0.277105 -0.280495 0.278281 -0.120317 -0.205688 0.319797 -0.172120 -0.130689 0.210875 0.090432 -0.199098 -0.237383 0.275319 -0.264513 -0.055768 -0.225134 0.373318 0.260175 -0.204717 -0.108066 -0.098847 -0.156889 -0.131331 0.088006 0.045738 0.083033 0.103263 0.085019 0.080020 0.098338 0.091693 0.111326 0.131184 0.119698 0.130657 0.134392 0.126737 0.121478 0.135685 0.131380 0.088828 0.124935 0.076476 0.125048 0.121449 0.123998
qa: -0.1892 -0.1745 -0.2556 -0.3462 -0.2584 -0.2974 0.0021 0.0763 0.0488 -0.0242 -0.2771 -0.2805 0.2783 -0.1203 -0.2057 0.3198 -0.1721 -0.1307 0.2109 0.0904 -0.1991 -0.2374 0.2753 -0.2645 -0.0558 -0.2251 0.3733 0.2602 -0.2047 -0.1081 -0.0988 -0.1569 -0.1313 0.0880 0.0457 0.0830 0.1033 0.0850 0.0800 0.0983 0.0917 0.1113 0.1312 0.1197 0.1307 0.1344 0.1267 0.1215 0.1357 0.1314 0.0888 0.1249 0.0765 0.1250 0.1214 0.1240
va: 1.0767 1.1132 2.1519 2.1424 2.0736 2.1205 3.1188 3.7455 3.8308 3.5544 3.9261 3.9444 4.3089 3.9699 4.0476 3.8371 4.0042 3.8420 3.8467 3.5344 3.9969 4.0187 3.8052 4.0380 3.8599 4.0391 4.2990 3.8185 4.0085 3.8761 3.9566 4.0032 3.9529 1.0377 1.0237 1.0040 1.0143 1.0070 1.0051 1.0039 1.0075 1.0095 1.0087 1.0186 1.0101 1.0201 1.0138 1.0191 0.9973 1.0153 0.9847 1.0154 1.0173 0.9987 1.0022 1.0006
dispcorr: -0.036328931 hartree
energy: -1560.126510646698
dipole: 17.89171 -18.18668 -0.29497 -8.53012 7.08477 -1.44535 -27.20577 26.05702 -1.14875
magnitude: 1.86967 au
magnitude: 4.75233 debye
