program: Orca
programVersion: 5.0.2
elementType: F F O O O O N C C C C C C C C C C C C C C C C C C C C C C C C C C H H H H H H H H H H H H H H H H H H H H H H H
charge: 0
multiplicity: 1
keywords: wb97x-d3
keywords: def2-TZVPP
keywords: def2/J RIJCOSX
keywords: DEFGRID2
keywords: scfconv7
keywords: smallprint printgap noloewdin
keywords: NOSOSCF
formula: C26H23F2NO4
InChI: InChI=1/C26H23F2NO4/c1-17(2)24(18-11-13-21(14-12-18)32-26(27)28)25(30)33-23(16-29)19-7-6-10-22(15-19)31-20-8-4-3-5-9-20/h3-15,17,23-24,26H,1-2H3
56 atoms
F  -3.743169 -3.789217 0.586942
F  -4.794056 -2.074565 -0.204662
O  2.721116 0.513623 0.99723
O  4.052668 0.045351 -0.733138
O  -2.699223 -2.294595 -0.696932
O  -1.620358 2.072458 -1.268237
N  2.32136 3.179638 2.933289
C  2.845976 -1.747309 0.378168
C  3.702687 -2.79138 -0.370884
C  1.359837 -1.866663 0.119312
C  3.516965 -4.167362 0.261621
C  3.439766 -2.864631 -1.870441
C  3.297557 -0.327104 0.117238
C  0.758033 -1.279341 -0.992793
C  0.555927 -2.602372 0.978153
C  2.862825 1.899038 0.721569
C  -0.596628 -1.416751 -1.23072
C  -0.800316 -2.778009 0.740066
C  -1.376173 -2.174917 -0.368197
C  1.918064 2.338907 -0.371479
C  0.576562 1.990297 -0.278954
C  2.386308 3.072165 -1.449762
C  -0.304139 2.407958 -1.265829
C  2.558564 2.595131 1.973559
C  1.497482 3.475137 -2.435647
C  0.154829 3.153277 -2.346023
C  -3.614413 -2.477616 0.28683
C  -2.343172 2.009118 -0.110157
C  -3.399572 1.109216 -0.091988
C  -2.100031 2.832749 0.982135
C  -4.214262 1.03407 1.02714
C  -2.911565 2.730978 2.102085
C  -3.968583 1.834444 2.133409
H  2.998811 -1.912542 1.451492
H  4.746951 -2.497607 -0.225704
H  3.75368 -4.161541 1.327433
H  4.172801 -4.896999 -0.213992
H  2.49318 -4.527337 0.146128
H  4.142831 -3.559036 -2.332174
H  2.435079 -3.232917 -2.082566
H  3.565257 -1.90259 -2.363489
H  1.344826 -0.692385 -1.688819
H  0.991997 -3.066089 1.854432
H  3.893792 2.139748 0.442621
H  -1.054102 -0.938671 -2.086522
H  -1.373834 -3.401212 1.412355
H  0.221943 1.396192 0.554333
H  3.436355 3.322281 -1.525418
H  1.853218 4.047866 -3.281308
H  -0.544528 3.469623 -3.108576
H  -3.384061 -1.925509 1.204422
H  -3.588211 0.489376 -0.958353
H  -1.290725 3.551048 0.97073
H  -5.048237 0.344885 1.028962
H  -2.713711 3.369051 2.952976
H  -4.601512 1.767604 3.007702
totalener: -1560.09155848 hartree
nucrepener: 3468.12924487 hartree
electener: -5028.22080335 hartree
oneelecener: -9026.76064747 hartree
twoeener: 3998.53984412 hartree
kineticenergy: 1553.71036810 hartree
xcener: -146.828770021804 hartree
chargesum: -0.0000000
charge: -0.190044 -0.181297 -0.262450 -0.333571 -0.252534 -0.299045 -0.001084 0.051792 0.092924 0.096832 -0.304259 -0.299674 0.284004 -0.256317 -0.225658 0.330159 -0.140741 -0.110594 0.186261 0.073269 -0.274206 -0.139334 0.260761 -0.263132 -0.084201 -0.223160 0.354997 0.329241 -0.252710 -0.206637 -0.140541 -0.105753 -0.147327 0.091342 0.046596 0.085517 0.095391 0.089833 0.094398 0.084256 0.102738 0.132345 0.119637 0.124539 0.130709 0.133126 0.146311 0.110632 0.129717 0.130389 0.100048 0.138126 0.138099 0.148952 0.132632 0.128696
qa: -0.1900 -0.1813 -0.2624 -0.3336 -0.2525 -0.2990 -0.0011 0.0518 0.0929 0.0968 -0.3043 -0.2997 0.2840 -0.2563 -0.2257 0.3302 -0.1407 -0.1106 0.1863 0.0733 -0.2742 -0.1393 0.2608 -0.2631 -0.0842 -0.2232 0.3550 0.3292 -0.2527 -0.2066 -0.1405 -0.1058 -0.1473 0.0913 0.0466 0.0855 0.0954 0.0898 0.0944 0.0843 0.1027 0.1323 0.1196 0.1245 0.1307 0.1331 0.1463 0.1106 0.1297 0.1304 0.1000 0.1381 0.1381 0.1490 0.1326 0.1287
va: 1.0853 1.0940 2.1298 2.1553 2.0767 2.0954 3.1195 3.8009 3.8139 3.4810 3.9365 3.9481 4.2990 3.9698 4.0750 3.8292 3.9540 3.9165 3.9428 3.5864 3.9615 4.0224 3.7515 4.0350 3.9461 4.0830 4.2949 3.7270 3.9567 3.9596 3.8866 3.9585 3.9807 1.0300 1.0218 1.0045 1.0096 1.0016 1.0077 0.9987 1.0157 1.0058 1.0066 1.0202 1.0137 1.0170 1.0090 1.0133 0.9995 1.0117 0.9784 1.0248 1.0038 0.9997 0.9986 1.0000
dispcorr: -0.036045463 hartree
energy: -1560.127603942450
dipole: 23.57494 -23.04750 0.52744 -6.46112 6.13738 -0.32374 -3.71360 3.40735 -0.30625
magnitude: 0.69050 au
magnitude: 1.75512 debye
