program: Orca
programVersion: 5.0.2
elementType: F F O O O O N C C C C C C C C C C C C C C C C C C C C C C C C C C H H H H H H H H H H H H H H H H H H H H H H H
charge: 0
multiplicity: 1
keywords: wb97x-d3
keywords: def2-TZVPP
keywords: def2/J RIJCOSX
keywords: DEFGRID2
keywords: scfconv7
keywords: smallprint printgap noloewdin
keywords: NOSOSCF
formula: C26H23F2NO4
InChI: InChI=1/C26H23F2NO4/c1-17(2)24(18-11-13-21(14-12-18)32-26(27)28)25(30)33-23(16-29)19-7-6-10-22(15-19)31-20-8-4-3-5-9-20/h3-15,17,23-24,26H,1-2H3
56 atoms
F  -3.413922 -2.667222 2.932816
F  -4.730483 -1.432259 1.747172
O  2.929191 0.330276 0.563931
O  2.863783 0.226669 -1.675371
O  -2.946431 -2.213644 0.799084
O  -1.838679 1.913254 0.546269
N  4.746364 2.383947 2.432745
C  2.585713 -1.795233 -0.369234
C  3.05429 -2.675038 -1.537308
C  1.111265 -1.924717 -0.046113
C  4.562509 -2.556285 -1.736398
C  2.670449 -4.129949 -1.288939
C  2.82673 -0.322045 -0.612834
C  0.695866 -2.245805 1.237555
C  0.140169 -1.694018 -1.018421
C  3.077047 1.733714 0.530138
C  -0.650352 -2.353728 1.555627
C  -1.205749 -1.789112 -0.717775
C  -1.599744 -2.118538 0.571623
C  1.76061 2.473547 0.677639
C  0.546366 1.811372 0.597839
C  1.790238 3.85561 0.832499
C  -0.631259 2.547992 0.633967
C  4.004511 2.078802 1.611002
C  0.608511 4.571435 0.896963
C  -0.612089 3.922736 0.783769
C  -3.442215 -1.724707 1.962866
C  -2.267286 1.459319 -0.667296
C  -1.523998 1.550979 -1.837809
C  -3.529467 0.877009 -0.683882
C  -2.047994 1.035539 -3.015803
C  -4.036456 0.367313 -1.866231
C  -3.29832 0.438494 -3.040804
H  3.149521 -2.08484 0.524034
H  2.559244 -2.335003 -2.451478
H  5.100735 -2.866051 -0.837529
H  4.874109 -1.542751 -1.985345
H  4.892554 -3.202769 -2.549894
H  3.129671 -4.507475 -0.372206
H  1.593322 -4.265754 -1.199786
H  3.015859 -4.75949 -2.109304
H  1.431885 -2.426075 2.010966
H  0.429266 -1.415251 -2.024066
H  3.541936 2.040715 -0.414256
H  -0.936028 -2.642092 2.55784
H  -1.953816 -1.593723 -1.474822
H  0.484414 0.734968 0.502576
H  2.73642 4.376891 0.912041
H  0.63701 5.644711 1.025657
H  -1.54246 4.473676 0.815805
H  -2.910153 -0.836744 2.321919
H  -0.544061 2.007555 -1.848448
H  -4.108274 0.82671 0.228535
H  -1.462805 1.108187 -3.92325
H  -5.016482 -0.090654 -1.865952
H  -3.697019 0.03981 -3.963624
totalener: -1560.09281838 hartree
nucrepener: 3483.66037340 hartree
electener: -5043.75319178 hartree
oneelecener: -9057.58700945 hartree
twoeener: 4013.83381767 hartree
kineticenergy: 1553.71246268 hartree
xcener: -146.830761506535 hartree
chargesum: -0.0000000
charge: -0.191848 -0.182547 -0.260886 -0.338049 -0.250531 -0.307203 0.000448 0.051667 0.057456 -0.056956 -0.277178 -0.278343 0.273531 -0.097421 -0.156471 0.285289 -0.142625 -0.155364 0.169123 -0.008642 -0.065582 -0.152528 0.150959 -0.246019 -0.120992 -0.115202 0.369868 0.341172 -0.192887 -0.254942 -0.137107 -0.068449 -0.174344 0.087247 0.046472 0.083090 0.101137 0.085580 0.079642 0.101819 0.090711 0.110905 0.125548 0.132406 0.137504 0.154984 0.080634 0.122594 0.131398 0.129574 0.094746 0.129053 0.125896 0.130260 0.126999 0.124407
qa: -0.1918 -0.1825 -0.2609 -0.3380 -0.2505 -0.3072 0.0004 0.0517 0.0575 -0.0570 -0.2772 -0.2783 0.2735 -0.0974 -0.1565 0.2853 -0.1426 -0.1554 0.1691 -0.0086 -0.0656 -0.1525 0.1510 -0.2460 -0.1210 -0.1152 0.3699 0.3412 -0.1929 -0.2549 -0.1371 -0.0684 -0.1743 0.0872 0.0465 0.0831 0.1011 0.0856 0.0796 0.1018 0.0907 0.1109 0.1255 0.1324 0.1375 0.1550 0.0806 0.1226 0.1314 0.1296 0.0947 0.1291 0.1259 0.1303 0.1270 0.1244
va: 1.0819 1.0970 2.1283 2.1530 2.0822 2.0853 3.1141 3.8065 3.8195 3.5911 3.9305 3.9461 4.2576 3.9725 3.9327 3.8001 3.9368 3.9574 3.9662 3.7193 3.8748 3.9925 3.8875 3.9866 3.9748 4.0173 4.2852 3.6407 3.8906 3.9729 3.9238 3.9230 3.9453 1.0374 1.0254 1.0038 1.0136 1.0072 1.0051 1.0032 1.0075 1.0131 1.0214 1.0202 1.0186 1.0015 1.0337 1.0121 1.0000 1.0082 0.9862 1.0101 1.0250 0.9995 1.0014 1.0023
dispcorr: -0.036676664 hartree
energy: -1560.129495047069
dipole: 22.10399 -22.15873 -0.05474 -8.10569 8.12108 0.01539 -20.83887 19.85660 -0.98226
magnitude: 0.98391 au
magnitude: 2.50089 debye
