program: Orca
programVersion: 5.0.2
elementType: F F O O O O N C C C C C C C C C C C C C C C C C C C C C C C C C C H H H H H H H H H H H H H H H H H H H H H H H
charge: 0
multiplicity: 1
keywords: wb97x-d3
keywords: def2-TZVPP
keywords: def2/J RIJCOSX
keywords: DEFGRID2
keywords: scfconv7
keywords: smallprint printgap noloewdin
keywords: NOSOSCF
formula: C26H23F2NO4
InChI: InChI=1/C26H23F2NO4/c1-17(2)24(18-11-13-21(14-12-18)32-26(27)28)25(30)33-23(16-29)19-7-6-10-22(15-19)31-20-8-4-3-5-9-20/h3-15,17,23-24,26H,1-2H3
56 atoms
F  -2.245773 -1.551561 -3.060794
F  -3.111577 -0.818572 -1.222973
O  2.950916 0.331223 0.761801
O  3.908592 -0.633963 -1.024863
O  -2.291068 -2.898523 -1.276047
O  -1.613429 3.265046 0.96066
N  3.736186 3.380986 1.803123
C  2.956483 -2.013033 0.711825
C  3.954815 -3.152409 0.471839
C  1.556863 -2.26263 0.18015
C  5.315744 -2.807006 1.069165
C  3.430067 -4.455139 1.064831
C  3.368054 -0.720595 0.041196
C  0.445079 -1.975252 0.96149
C  1.356163 -2.722383 -1.118316
C  2.867864 1.597575 0.105429
C  -0.839682 -2.155694 0.472786
C  0.078836 -2.913941 -1.61625
C  -1.014713 -2.632257 -0.813971
C  1.436982 1.81515 -0.319086
C  0.532897 2.464356 0.507248
C  1.007757 1.24291 -1.511695
C  -0.799792 2.558006 0.131749
C  3.352843 2.592656 1.061037
C  -0.327848 1.328122 -1.866926
C  -1.237081 1.991419 -1.058625
C  -2.938471 -1.934475 -1.965242
C  -2.913819 2.899406 1.152977
C  -3.320939 1.57244 1.211168
C  -3.827283 3.925136 1.351518
C  -4.654636 1.282645 1.455287
C  -5.153934 3.619489 1.608817
C  -5.576593 2.299231 1.655099
H  2.883621 -1.839142 1.790033
H  4.084224 -3.285585 -0.605904
H  5.242102 -2.643702 2.146787
H  5.752281 -1.914161 0.621982
H  6.021845 -3.622629 0.911328
H  3.282826 -4.364302 2.1435
H  2.480061 -4.756931 0.625103
H  4.142492 -5.263809 0.899682
H  0.579978 -1.601358 1.96845
H  2.203972 -2.933224 -1.757045
H  3.530106 1.61846 -0.765099
H  -1.697474 -1.948259 1.098139
H  -0.064647 -3.296169 -2.617543
H  0.846874 2.913544 1.441699
H  1.707693 0.725317 -2.15445
H  -0.669532 0.876004 -2.78753
H  -2.274297 2.06384 -1.356698
H  -3.910504 -2.322398 -2.267498
H  -2.609034 0.770819 1.065276
H  -3.491254 4.952782 1.3102
H  -4.970814 0.248605 1.493504
H  -5.861979 4.422087 1.767229
H  -6.614537 2.064691 1.847803
totalener: -1560.09189500 hartree
nucrepener: 3426.22207389 hartree
electener: -4986.31396889 hartree
oneelecener: -8943.45921743 hartree
twoeener: 3957.14524854 hartree
kineticenergy: 1553.72663800 hartree
xcener: -146.825661620573 hartree
chargesum: 0.0000000
charge: -0.202563 -0.197084 -0.251757 -0.351247 -0.314516 -0.294494 -0.002024 0.092087 0.036195 0.011751 -0.278905 -0.273002 0.288237 -0.151753 -0.192895 0.304941 -0.155085 -0.129788 0.227914 0.036561 -0.212589 -0.177585 0.252431 -0.259665 -0.107475 -0.178438 0.404916 0.257910 -0.156149 -0.210970 -0.123351 -0.092694 -0.139199 0.086667 0.048731 0.083926 0.101809 0.085136 0.080237 0.099688 0.089517 0.110723 0.128067 0.131294 0.124689 0.124654 0.122504 0.130580 0.130354 0.135639 0.111185 0.118219 0.126191 0.120722 0.125636 0.124118
qa: -0.2026 -0.1971 -0.2518 -0.3512 -0.3145 -0.2945 -0.0020 0.0921 0.0362 0.0118 -0.2789 -0.2730 0.2882 -0.1518 -0.1929 0.3049 -0.1551 -0.1298 0.2279 0.0366 -0.2126 -0.1776 0.2524 -0.2597 -0.1075 -0.1784 0.4049 0.2579 -0.1561 -0.2110 -0.1234 -0.0927 -0.1392 0.0867 0.0487 0.0839 0.1018 0.0851 0.0802 0.0997 0.0895 0.1107 0.1281 0.1313 0.1247 0.1247 0.1225 0.1306 0.1304 0.1356 0.1112 0.1182 0.1262 0.1207 0.1256 0.1241
va: 1.0839 1.0888 2.1299 2.1426 2.0978 2.1237 3.1146 3.6998 3.8356 3.5577 3.9364 3.9386 4.2928 4.0024 3.9865 3.8157 4.0231 4.0415 3.8074 3.6972 4.1039 3.9408 3.8767 4.0427 3.8999 3.9370 4.2779 3.8162 3.9328 4.0319 3.9605 3.9378 3.9614 1.0361 1.0260 1.0048 1.0126 1.0062 1.0054 1.0044 1.0076 1.0146 1.0178 1.0227 1.0050 1.0106 1.0335 1.0169 1.0129 1.0064 0.9784 1.0049 1.0147 1.0036 0.9989 1.0005
dispcorr: -0.034206207 hartree
energy: -1560.126101211261
dipole: 15.09125 -16.38932 -1.29807 -15.79839 14.12758 -1.67081 10.32973 -10.88674 -0.55701
magnitude: 2.18788 au
magnitude: 5.56116 debye
