program: Gaussian 09
title: 000074697
version: EM64L-G09RevD.01
frameworkgroup: C1[X(C7H9NO2S)]
method: RPBEPBE
basis: SDD
operation: Freq
keyword: #p
keyword: freq=noraman
keyword: PBEPBE/SDD
title: #p freq=noraman PBEPBE/SDD
converged: NO NO NO NO
title: Mulliken charges:
elementType: S O O N C C C C C C C H H H H H H H H H
charge: 0.941338 -0.541964 -0.543585 -0.719643 -0.006682 0.464797 -0.386195 -0.261512 -0.385549 -0.192122 -0.796809 0.285708 0.285704 0.239689 0.240269 0.236161 0.228420 0.242819 0.334382 0.334772
chargesum: 0.00000
title: Mulliken charges with hydrogens summed into heavy atoms:
elementType: S O O N C C C C C C C
charge: 0.941338 -0.541964 -0.543585 -0.050488 -0.006682 0.464797 -0.100486 0.024192 -0.145860 0.048147 -0.089409
polarizability: 1.42974314e+02 -2.39042157e+00 1.20330420e+02 -1.66821400e+00 -2.69403522e-01 7.01888772e+01
1716.lowfreq: -8.7901 -0.0010 -0.0006 0.0005 7.4813 10.7294 13.0320 26.5795 102.9116
frequency: -7.4962 25.4387 102.8796 108.7070 132.9632 206.2567 224.5154 239.5192 264.7685 300.4079 321.8700 396.0640 426.6378 436.5486 474.3733 512.5018 546.1046 653.0653 691.4305 791.7571 792.8543 800.7536 832.4300 899.5172 905.4150 932.5464 978.1371 991.0129 994.4637 1051.0580 1060.4042 1076.6975 1096.5349 1177.8202 1218.0395 1293.5151 1376.0192 1399.6472 1421.2436 1468.7390 1471.8834 1475.1746 1537.6314 1573.6044 1616.6728 2981.2340 3064.1999 3093.1521 3130.7705 3145.2364 3152.5761 3170.7496 3362.0542 3527.9378
redmass: 1.0187 4.2352 1.9410 2.7736 5.6966 3.3212 4.8144 7.3005 2.8809 3.4708 8.4821 3.4642 9.8559 3.0195 3.6006 5.0931 4.2842 6.2989 2.3516 2.8738 2.6829 1.5041 4.0717 1.6579 2.5323 1.3613 3.8211 1.5533 1.4214 1.5733 1.8806 1.6721 1.5121 1.1067 2.3710 1.3064 5.6729 1.2199 2.6339 1.8607 1.2438 1.1311 1.0854 5.7487 6.9096 1.0388 1.0951 1.1000 1.0885 1.0922 1.0915 1.0987 1.0416 1.0999
irintensity: 0.5503 0.5882 26.5682 16.0787 0.8090 1.1168 5.3631 6.7399 5.8807 0.6905 1.9460 0.0177 62.5636 11.9959 174.1423 3.4382 19.9385 1.9678 29.5605 49.2701 128.9901 22.9098 69.3435 22.5481 40.0326 3.1839 0.9172 0.6493 0.7683 17.9479 18.3093 21.4815 14.6912 0.5762 0.2913 2.2242 5.1321 14.7534 2.5551 26.3389 18.1029 19.2675 23.4183 8.4237 14.5669 22.5986 17.6503 14.4750 9.4846 2.3858 9.8145 12.1044 25.7707 24.1884
temp: 298.150 k
press: 1.00000 atm
elementType: 16 8 8 7 6 6 6 6 6 6 6 1 1 1 1 1 1 1 1 1
symmnumber: 1
zpe: 388340.9 jmol-1
zpe.correction: 0.147911 hartree
zpe.thermalcorrener: 0.159167 hartree
zpe.thermalcorrenthalpy: 0.160111 hartree
zpe.thermalcorrgfe: 0.110093 hartree
zpe.sumelectzpe: -874.404726 hartree
zpe.sumelectthermal: -874.393471 hartree
zpe.sumelectthermalent: -874.392527 hartree
zpe.sumelectthermalfe: -874.442544 hartree
dipole: 3.7223 0.3252 3.0607
dipole: 4.8301
quadrupole: -64.6090 -69.7453 -77.7117
quadrupole: 0.6108 -10.7816 -1.8071
quadrupole: 6.0797 0.9433 -7.0230 0.6108 -10.7816 -1.8071
hfenergy: -874.5526375 hartree
pointgroup: C01 [X(C7H9N1O2S1)]
dipole: -1.5078658 0.1221699 -1.1500192 debye
dipolederiv: 1.9830388 -0.1285535 -0.2464602 -0.1825222 1.2034345 0.057617 -0.2219686 0.0477618 1.5825749 -0.7804346 -0.0509231 -0.0267603 -0.0484099 -0.5846432 -0.1755432 0.0278227 -0.009675 -0.5501999 -0.7139751 0.0768567 0.0492618 0.1034368 -0.6422486 0.1684468 0.0302456 -0.0051717 -0.5481388 -0.6909614 0.0604694 0.0798516 0.0746164 -0.3725183 -0.0186535 0.1471491 -0.0260068 -0.9072834 0.0619446 -0.009204 -0.0423976 -0.0385652 -0.0262089 0.0068759 -0.122224 0.0152694 -0.1457216 0.2076676 0.3102095 0.0050442 0.2094557 0.2043364 0.0067506 0.0636052 0.0433768 -0.0107959 -0.3136911 -0.2164823 0.0197981 0.1906879 -0.0981427 0.0027573 -0.0050715 -0.0211368 -0.1111721 -0.2731798 0.1547477 0.0174495 -0.1366182 -0.0933002 -0.0077257 0.01803 0.0229622 -0.1124509 0.0764055 -0.0510521 0.0097677 -0.1572434 -0.1063676 -0.0028598 -0.0030573 -0.0082849 -0.1524866 0.0060528 -0.1172674 -0.0028299 0.0292382 0.1162015 0.0044308 0.0060993 -0.0035361 -0.1213221 -0.0536622 -0.1050005 -0.0102114 -0.103769 -0.0784803 -0.00615 -0.0784607 -0.0701426 0.0554176 0.1498858 0.0401811 -0.0050321 0.0153029 0.028562 -0.0000685 0.0027592 0.0139209 0.1472134 0.090525 -0.0747342 -0.0057467 -0.0446582 0.088945 0.0056674 -0.0034035 -0.0072042 0.1598826 -0.1128637 0.0421533 0.0018546 0.0246858 0.0932013 0.0033153 0.0074224 0.0015907 0.1493689 0.0321304 0.0578975 0.0010216 0.058387 -0.0820914 -0.00101 0.0003747 -0.0005023 0.1592676 0.0496029 0.0704771 -0.0628004 0.0035681 -0.0425866 0.086519 -0.005067 0.1077054 0.0538306 -0.1005455 0.0081344 0.0772196 0.0808461 0.0462218 -0.0465622 0.0904567 -0.0013307 0.0795761 0.0536006 -0.0590813 -0.0174767 -0.0711295 0.0489573 -0.0499253 -0.0551383 -0.0778503 -0.0838059 0.1443846 -0.0697867 0.0596647 -0.0292179 0.1699434 -0.110562 0.0391486 -0.0626593 0.178666 0.1840748 0.0609584 0.0987819 0.0219088 0.1267848 0.0766798 0.0612775 0.0409135 0.1775796 unknown
polarizability: 142.6798636|2.8466632|120.3991667|-4.1767199|0.9667654|70.4145814 unknown
InChI: InChI=1S/C7H9NO2S/c1-6-3-2-4-7(5-6)11(8,9)10/h2-5H,8H2,1H3
charge 0 multiplicity 1
20 atoms
S  2.061368 -0.215119 0.055511
O  2.854416 1.077332 0.655507
O  2.220886 -1.724669 0.652486
N  2.518529 -0.3187 -1.723563
C  0.225031 0.200975 0.011909
C  -2.074426 -0.56875 0.020294
C  -0.685985 -0.864231 0.027091
C  -0.138763 1.555668 0.005651
C  -2.471207 0.794526 0.003872
C  -1.522581 1.84309 0.000162
C  -3.099698 -1.688316 0.013587
H  -0.324144 -1.897693 0.070138
H  0.62153 2.342277 0.03314
H  -3.540535 1.037125 0.006038
H  -1.858192 2.885399 0.002017
H  -2.749993 -2.560737 0.592594
H  -4.062314 -1.356883 0.439781
H  -3.297052 -2.036859 -1.01853
H  3.226574 0.410331 -1.914819
H  2.864555 -1.275467 -1.908765
