program: Orca
programVersion: 5.0.2
elementType: F F O O O O N C C C C C C C C C C C C C C C C C C C C C C C C C C H H H H H H H H H H H H H H H H H H H H H H H
charge: 0
multiplicity: 1
keywords: wb97x-d3
keywords: def2-TZVPP
keywords: def2/J RIJCOSX
keywords: DEFGRID2
keywords: scfconv7
keywords: smallprint printgap noloewdin
keywords: NOSOSCF
formula: C26H23F2NO4
InChI: InChI=1/C26H23F2NO4/c1-17(2)24(18-11-13-21(14-12-18)32-26(27)28)25(30)33-23(16-29)19-7-6-10-22(15-19)31-20-8-4-3-5-9-20/h3-15,17,23-24,26H,1-2H3
56 atoms
F  -4.266232 -2.331492 0.261284
F  -3.291254 -3.957314 -0.780057
O  2.733047 0.503952 0.899679
O  3.686878 -0.19095 -1.000625
O  -2.850028 -1.862151 -1.413337
O  -1.769022 2.273294 -0.91624
N  2.77328 3.303092 2.667707
C  2.526904 -1.780954 0.409803
C  3.354715 -2.955804 -0.131535
C  1.084062 -1.79006 -0.052858
C  4.776196 -2.923582 0.422486
C  2.682722 -4.279938 0.216482
C  3.080409 -0.435006 0.002155
C  0.043676 -1.849823 0.863347
C  0.769374 -1.729149 -1.407156
C  2.921066 1.852832 0.49884
C  -1.282229 -1.87935 0.457478
C  -0.546684 -1.773553 -1.829728
C  -1.568905 -1.859734 -0.898137
C  1.867787 2.29705 -0.48821
C  0.530155 2.038114 -0.21302
C  2.238857 2.968143 -1.641125
C  -0.442194 2.490089 -1.093492
C  2.839267 2.647718 1.726913
C  1.257475 3.401457 -2.520982
C  -0.078568 3.17345 -2.249964
C  -3.786139 -2.718952 -0.94773
C  -2.299371 2.104244 0.333001
C  -3.239453 1.097516 0.48461
C  -1.973834 2.934786 1.398145
C  -3.854602 0.914329 1.713294
C  -2.589078 2.734156 2.624263
C  -3.527897 1.725598 2.789447
H  2.530507 -1.832914 1.503854
H  3.407924 -2.868903 -1.220687
H  4.773607 -2.98603 1.513269
H  5.315898 -2.021858 0.136068
H  5.350027 -3.773039 0.050902
H  2.588527 -4.401616 1.298296
H  1.685471 -4.36446 -0.213725
H  3.274929 -5.1166 -0.155056
H  0.263777 -1.874148 1.923313
H  1.555743 -1.649997 -2.147175
H  3.91731 1.996381 0.067713
H  -2.062876 -1.903356 1.202754
H  -0.78663 -1.736065 -2.883892
H  0.250861 1.492181 0.679643
H  3.283974 3.147349 -1.856867
H  1.53648 3.925797 -3.424913
H  -0.849594 3.516261 -2.92719
H  -4.613092 -2.738347 -1.657291
H  -3.485688 0.470989 -0.360708
H  -1.249063 3.730107 1.278674
H  -4.58535 0.124543 1.826338
H  -2.332422 3.378585 3.454516
H  -4.003953 1.577576 3.749255
totalener: -1560.09262457 hartree
nucrepener: 3474.83694295 hartree
electener: -5034.92956752 hartree
oneelecener: -9040.95317862 hartree
twoeener: 4006.02361110 hartree
kineticenergy: 1553.72724870 hartree
xcener: -146.828071749655 hartree
chargesum: 0.0000000
charge: -0.201951 -0.186917 -0.265816 -0.339840 -0.319613 -0.298806 -0.002129 0.078109 0.054451 -0.039630 -0.277818 -0.279481 0.276314 -0.152576 -0.125739 0.314159 -0.119251 -0.178366 0.230919 0.097902 -0.270951 -0.155854 0.276757 -0.259791 -0.080742 -0.225176 0.417435 0.276622 -0.240131 -0.180581 -0.112589 -0.111429 -0.134227 0.086405 0.046179 0.081444 0.101001 0.085001 0.078093 0.101350 0.090535 0.109945 0.125805 0.124090 0.120688 0.124468 0.132184 0.107169 0.127218 0.127916 0.100851 0.142059 0.135626 0.130445 0.131506 0.126757
qa: -0.2020 -0.1869 -0.2658 -0.3398 -0.3196 -0.2988 -0.0021 0.0781 0.0545 -0.0396 -0.2778 -0.2795 0.2763 -0.1526 -0.1257 0.3142 -0.1193 -0.1784 0.2309 0.0979 -0.2710 -0.1559 0.2768 -0.2598 -0.0807 -0.2252 0.4174 0.2766 -0.2401 -0.1806 -0.1126 -0.1114 -0.1342 0.0864 0.0462 0.0814 0.1010 0.0850 0.0781 0.1014 0.0905 0.1099 0.1258 0.1241 0.1207 0.1245 0.1322 0.1072 0.1272 0.1279 0.1009 0.1421 0.1356 0.1304 0.1315 0.1268
va: 1.0762 1.1036 2.1388 2.1557 2.0714 2.1069 3.1205 3.7542 3.8263 3.5386 3.9305 3.9474 4.2998 3.9870 3.9760 3.8405 3.9784 4.0836 3.7493 3.6101 3.9746 4.0284 3.7630 4.0320 3.9496 4.0636 4.2770 3.7766 3.9737 3.9450 3.9128 3.9503 3.9609 1.0374 1.0263 1.0042 1.0144 1.0073 1.0052 1.0038 1.0076 1.0125 1.0194 1.0190 1.0311 1.0116 1.0149 1.0137 0.9997 1.0128 0.9792 1.0202 1.0038 1.0083 0.9987 0.9998
dispcorr: -0.035340918 hartree
energy: -1560.127965483745
dipole: 21.94846 -22.26709 -0.31864 -7.24781 6.39470 -0.85311 2.35485 -3.24045 -0.88560
magnitude: 1.27028 au
magnitude: 3.22880 debye
