program: Orca
programVersion: 5.0.2
elementType: F F O O O O N C C C C C C C C C C C C C C C C C C C C C C C C C C H H H H H H H H H H H H H H H H H H H H H H H
charge: 0
multiplicity: 1
keywords: wb97x-d3
keywords: def2-TZVPP
keywords: def2/J RIJCOSX
keywords: DEFGRID2
keywords: scfconv7
keywords: smallprint printgap noloewdin
keywords: NOSOSCF
formula: C26H23F2NO4
InChI: InChI=1/C26H23F2NO4/c1-17(2)24(18-11-13-21(14-12-18)32-26(27)28)25(30)33-23(16-29)19-7-6-10-22(15-19)31-20-8-4-3-5-9-20/h3-15,17,23-24,26H,1-2H3
56 atoms
F  -3.183536 -1.165908 -1.812835
F  -4.320129 -2.55907 -0.610061
O  3.311299 0.419504 0.812722
O  3.957321 -0.1968 -1.240303
O  -2.389786 -1.941171 0.122177
O  -1.768554 1.161712 0.866947
N  3.227978 3.313131 2.416956
C  3.273711 -1.881204 0.357671
C  4.000903 -2.9916 -0.409802
C  1.76094 -1.94796 0.26605
C  5.512168 -2.881216 -0.233857
C  3.512583 -4.358524 0.058597
C  3.599416 -0.489731 -0.135555
C  0.978687 -2.070706 1.408884
C  1.119097 -1.810724 -0.957586
C  3.012517 1.733316 0.348891
C  -0.401556 -2.078582 1.334388
C  -0.264282 -1.797203 -1.050316
C  -1.022791 -1.942572 0.101963
C  1.62293 1.760335 -0.241215
C  0.527256 1.507016 0.575253
C  1.448554 1.967138 -1.600946
C  -0.743986 1.462528 0.027478
C  3.132549 2.607053 1.516311
C  0.169746 1.922074 -2.138861
C  -0.928685 1.66528 -1.337423
C  -3.082542 -2.243746 -1.001259
C  -2.980864 1.777956 0.723542
C  -4.115409 1.005927 0.923878
C  -3.089325 3.136161 0.451666
C  -5.36564 1.600022 0.853133
C  -4.347314 3.713777 0.373084
C  -5.489494 2.95239 0.571978
H  3.552182 -1.947622 1.415129
H  3.769815 -2.885921 -1.473994
H  5.791175 -2.967154 0.819025
H  5.907885 -1.940378 -0.613664
H  6.019118 -3.684475 -0.769483
H  3.704061 -4.500669 1.124976
H  2.444104 -4.493936 -0.106603
H  4.033618 -5.154223 -0.474687
H  1.454679 -2.161139 2.377281
H  1.696234 -1.6779 -1.863882
H  3.745423 2.06211 -0.394297
H  -1.003286 -2.176421 2.227896
H  -0.718019 -1.628827 -2.016689
H  0.648677 1.342146 1.63889
H  2.302917 2.149653 -2.239078
H  0.027795 2.076375 -3.200168
H  -1.920181 1.617542 -1.768248
H  -2.647763 -3.069993 -1.575311
H  -4.014663 -0.048135 1.140334
H  -2.203399 3.742095 0.310877
H  -6.248528 0.995057 1.011399
H  -4.430792 4.772084 0.163746
H  -6.467248 3.410696 0.512434
totalener: -1560.09142070 hartree
nucrepener: 3497.35893541 hartree
electener: -5057.45035611 hartree
oneelecener: -9085.76301999 hartree
twoeener: 4028.31266389 hartree
kineticenergy: 1553.73544081 hartree
xcener: -146.832590092820 hartree
chargesum: 0.0000000
charge: -0.194927 -0.181599 -0.260004 -0.342920 -0.273852 -0.294723 0.000446 0.060411 0.059996 -0.038385 -0.275007 -0.282329 0.286854 -0.120837 -0.189013 0.338749 -0.154692 -0.149430 0.240447 0.066328 -0.277266 -0.132549 0.250434 -0.279175 -0.099728 -0.171407 0.379648 0.253082 -0.216091 -0.163095 -0.098540 -0.124105 -0.138160 0.087995 0.044592 0.080927 0.101903 0.084200 0.078570 0.098196 0.091159 0.108115 0.124728 0.121334 0.123231 0.128797 0.116657 0.115344 0.130748 0.136881 0.110880 0.129178 0.131522 0.125876 0.126141 0.124465
qa: -0.1949 -0.1816 -0.2600 -0.3429 -0.2739 -0.2947 0.0004 0.0604 0.0600 -0.0384 -0.2750 -0.2823 0.2869 -0.1208 -0.1890 0.3387 -0.1547 -0.1494 0.2404 0.0663 -0.2773 -0.1325 0.2504 -0.2792 -0.0997 -0.1714 0.3796 0.2531 -0.2161 -0.1631 -0.0985 -0.1241 -0.1382 0.0880 0.0446 0.0809 0.1019 0.0842 0.0786 0.0982 0.0912 0.1081 0.1247 0.1213 0.1232 0.1288 0.1167 0.1153 0.1307 0.1369 0.1109 0.1292 0.1315 0.1259 0.1261 0.1245
va: 1.0744 1.1104 2.1494 2.1493 2.0879 2.0573 3.1200 3.7602 3.8173 3.5771 3.9273 3.9470 4.2989 3.9876 4.0465 3.8146 4.0194 3.9051 3.7940 3.5812 4.1017 3.9766 3.7385 4.0450 3.9411 3.9275 4.2667 3.8049 4.0074 3.9507 3.9649 3.9513 3.9604 1.0364 1.0253 1.0038 1.0150 1.0072 1.0051 1.0035 1.0075 1.0105 1.0244 1.0177 1.0120 1.0195 1.0326 1.0177 0.9989 1.0122 0.9826 1.0352 1.0054 1.0004 1.0003 1.0002
dispcorr: -0.037143037 hartree
energy: -1560.128563736082
dipole: 21.94007 -22.16289 -0.22281 -10.75539 9.48678 -1.26861 -1.36352 0.27120 -1.09233
magnitude: 1.68884 au
magnitude: 4.29270 debye
