program: Orca
programVersion: 5.0.2
elementType: F F O O O O N C C C C C C C C C C C C C C C C C C C C C C C C C C H H H H H H H H H H H H H H H H H H H H H H H
charge: 0
multiplicity: 1
keywords: wb97x-d3
keywords: def2-TZVPP
keywords: def2/J RIJCOSX
keywords: DEFGRID2
keywords: scfconv7
keywords: smallprint printgap noloewdin
keywords: NOSOSCF
formula: C26H23F2NO4
InChI: InChI=1/C26H23F2NO4/c1-17(2)24(18-11-13-21(14-12-18)32-26(27)28)25(30)33-23(16-29)19-7-6-10-22(15-19)31-20-8-4-3-5-9-20/h3-15,17,23-24,26H,1-2H3
56 atoms
F  -4.804443 -1.808753 1.167548
F  -3.7923 -2.969908 -0.354806
O  3.319822 0.380437 0.679153
O  3.160925 0.023784 -1.523283
O  -2.671273 -2.064579 1.342285
O  -1.439246 1.902094 0.829093
N  4.445261 2.841483 2.591246
C  2.835005 -1.819973 0.013288
C  3.265491 -2.850324 -1.042032
C  1.355672 -1.854108 0.339606
C  4.775818 -2.811911 -1.256196
C  2.828608 -4.250383 -0.62602
C  3.137687 -0.399222 -0.404367
C  0.919087 -2.028865 1.648219
C  0.396842 -1.708242 -0.654655
C  3.414508 1.772044 0.442054
C  -0.428402 -2.078545 1.953502
C  -0.959173 -1.778214 -0.371387
C  -1.373268 -1.965592 0.941952
C  2.077061 2.409292 0.133201
C  0.899958 1.85206 0.611736
C  2.045586 3.571316 -0.622845
C  -0.30699 2.466044 0.319216
C  3.986533 2.349684 1.660399
C  0.832786 4.186603 -0.888833
C  -0.35048 3.640272 -0.421608
C  -3.681817 -1.888302 0.448942
C  -2.501066 1.668009 0.010875
C  -2.356942 1.345929 -1.335051
C  -3.763528 1.71322 0.589286
C  -3.48685 1.082959 -2.096133
C  -4.882314 1.438645 -0.181972
C  -4.75263 1.12764 -1.528547
H  3.385786 -2.026416 0.937223
H  2.779611 -2.601005 -1.989808
H  5.308846 -3.037051 -0.32939
H  5.122365 -1.845494 -1.620445
H  5.076485 -3.558538 -1.991694
H  3.272499 -4.532839 0.331524
H  1.747078 -4.335343 -0.527683
H  3.152006 -4.984576 -1.364403
H  1.643194 -2.134251 2.446625
H  0.701629 -1.552181 -1.68206
H  4.107728 1.977086 -0.381534
H  -0.757472 -2.218688 2.974489
H  -1.660889 -1.702188 -1.189723
H  0.895962 0.945054 1.203023
H  2.964284 3.999045 -1.004329
H  0.807543 5.098521 -1.469776
H  -1.297413 4.120243 -0.632435
H  -3.5742 -0.996529 -0.174043
H  -1.374877 1.297481 -1.787446
H  -3.859711 1.956849 1.639065
H  -3.371081 0.835746 -3.143337
H  -5.86197 1.471614 0.275264
H  -5.627707 0.918478 -2.128217
totalener: -1560.09454819 hartree
nucrepener: 3471.81597529 hartree
electener: -5031.91052348 hartree
oneelecener: -9034.03757422 hartree
twoeener: 4002.12705075 hartree
kineticenergy: 1553.71671957 hartree
xcener: -146.832513528189 hartree
chargesum: 0.0000000
charge: -0.179859 -0.194074 -0.265175 -0.336572 -0.255217 -0.292432 0.003873 0.083841 0.051436 -0.090815 -0.277274 -0.279077 0.276413 -0.119722 -0.155181 0.266959 -0.177143 -0.181030 0.278583 0.084775 -0.197483 -0.156644 0.177734 -0.252173 -0.099302 -0.145566 0.493232 0.258745 -0.187633 -0.220445 -0.115473 -0.091071 -0.145695 0.085991 0.047331 0.082443 0.099728 0.085140 0.079614 0.102039 0.089566 0.109423 0.122618 0.129909 0.125955 0.114130 0.150502 0.108588 0.130531 0.136675 -0.015256 0.136635 0.129641 0.131778 0.127308 0.129175
qa: -0.1799 -0.1941 -0.2652 -0.3366 -0.2552 -0.2924 0.0039 0.0838 0.0514 -0.0908 -0.2773 -0.2791 0.2764 -0.1197 -0.1552 0.2670 -0.1771 -0.1810 0.2786 0.0848 -0.1975 -0.1566 0.1777 -0.2522 -0.0993 -0.1456 0.4932 0.2587 -0.1876 -0.2204 -0.1155 -0.0911 -0.1457 0.0860 0.0473 0.0824 0.0997 0.0851 0.0796 0.1020 0.0896 0.1094 0.1226 0.1299 0.1260 0.1141 0.1505 0.1086 0.1305 0.1367 -0.0153 0.1366 0.1296 0.1318 0.1273 0.1292
va: 1.1081 1.0914 2.1324 2.1574 2.1175 2.0777 3.1222 3.7512 3.8232 3.5613 3.9292 3.9484 4.2636 3.9769 3.9916 3.8521 4.0530 3.9386 3.8688 3.6449 4.0413 4.0349 3.9140 4.0135 3.9508 3.9671 4.2982 3.6506 3.8481 4.0060 3.9049 3.8849 3.9102 1.0379 1.0251 1.0042 1.0138 1.0074 1.0050 1.0030 1.0077 1.0125 1.0233 1.0160 1.0137 1.0179 1.0015 1.0109 1.0003 1.0023 1.0021 1.0101 1.0158 1.0005 1.0018 1.0019
dispcorr: -0.036087331 hartree
energy: -1560.130635521167
dipole: 20.86467 -21.20938 -0.34471 -7.75732 7.74914 -0.00817 -13.07611 11.70224 -1.37386
magnitude: 1.41647 au
magnitude: 3.60038 debye
