program: Orca
programVersion: 5.0.2
elementType: Cl O O O N C C C C C C C C C C C C C C C C C C C C C C C C C H H H H H H H H H H H H H H H H H H H H H H
charge: 0
multiplicity: 1
keywords: wb97x-d3
keywords: def2-TZVPP
keywords: def2/J RIJCOSX
keywords: DEFGRID2
keywords: scfconv7
keywords: smallprint printgap noloewdin
keywords: NOSOSCF
formula: C25H22ClNO3
InChI: InChI=1/C25H22ClNO3/c1-17(2)24(18-11-13-20(26)14-12-18)25(28)30-23(16-27)19-7-6-10-22(15-19)29-21-8-4-3-5-9-21/h3-15,17,23-24H,1-2H3
52 atoms
Cl -2.056051 -3.386371 3.276777
O  1.989139 0.561802 -0.370505
O  3.818435 -0.296728 0.566728
O  -2.415546 2.977342 -0.770165
N  2.189164 1.815501 2.779969
C  2.280775 -1.768371 -0.585866
C  1.875671 -1.74058 -2.070696
C  1.170667 -2.176315 0.363063
C  3.054176 -1.309239 -2.937493
C  1.378185 -3.115179 -2.499155
C  2.81317 -0.448931 -0.077618
C  1.433778 -3.093973 1.374141
C  -0.109377 -1.633973 0.273565
C  2.271343 1.846662 0.163542
C  0.450178 -3.474049 2.275823
C  -1.103541 -2.001378 1.165596
C  1.219346 2.790784 -0.360629
C  -0.814033 -2.920813 2.161831
C  -0.119415 2.423888 -0.285241
C  1.593815 4.004719 -0.915426
C  -1.081322 3.271884 -0.811256
C  2.229437 1.803144 1.630312
C  0.613641 4.858917 -1.403957
C  -0.721291 4.49389 -1.367702
C  -2.831315 1.67015 -0.877333
C  -2.314512 0.813001 -1.841435
C  -3.837944 1.252835 -0.019849
C  -2.813854 -0.478198 -1.933642
C  -4.338454 -0.036945 -0.134195
C  -3.825908 -0.908717 -1.08487
H  3.100493 -2.483664 -0.475936
H  1.061059 -1.024605 -2.21169
H  2.772395 -1.307623 -3.990984
H  3.407323 -0.30363 -2.700644
H  3.896665 -1.99445 -2.821729
H  2.146375 -3.877031 -2.348402
H  1.119375 -3.111203 -3.55869
H  0.488849 -3.423406 -1.948885
H  2.422168 -3.52788 1.461813
H  -0.357844 -0.922929 -0.50379
H  3.26796 2.188693 -0.13092
H  0.673169 -4.192782 3.052486
H  -2.092996 -1.572706 1.076961
H  -0.406206 1.486116 0.175834
H  2.638764 4.28035 -0.971097
H  0.894891 5.808627 -1.838325
H  -1.483694 5.149511 -1.768427
H  -1.533333 1.141203 -2.51564
H  -4.230525 1.933292 0.725079
H  -2.407692 -1.148988 -2.679494
H  -5.125886 -0.361624 0.533181
H  -4.211222 -1.916367 -1.163921
elementType: Cl O N C H
totalener: -1706.64340863 hartree
nucrepener: 3039.66770111 hartree
electener: -4746.31110974 hartree
oneelecener: -8373.29190953 hartree
twoeener: 3626.98079979 hartree
cpcmener: -0.04150485 hartree
kineticenergy: 1700.53008016 hartree
xcener: -142.759511398868 hartree
chargesum: -0.0000000
charge: -0.095190 -0.267496 -0.440204 -0.338535 -0.096153 0.159958 0.037973 0.000487 -0.296827 -0.302318 0.345894 -0.185191 -0.231885 0.397766 -0.153005 -0.109121 0.013704 0.075507 -0.204976 -0.211517 0.252674 -0.224896 -0.109493 -0.237812 0.294712 -0.189308 -0.250208 -0.137961 -0.104177 -0.215709 0.101152 0.049590 0.095781 0.090897 0.095602 0.094289 0.097453 0.099272 0.142385 0.122294 0.139618 0.143334 0.140061 0.159060 0.149554 0.162519 0.151139 0.158663 0.148186 0.162918 0.159982 0.159562
qa: -0.0952 -0.2675 -0.4402 -0.3385 -0.0962 0.1600 0.0380 0.0005 -0.2968 -0.3023 0.3459 -0.1852 -0.2319 0.3978 -0.1530 -0.1091 0.0137 0.0755 -0.2050 -0.2115 0.2527 -0.2249 -0.1095 -0.2378 0.2947 -0.1893 -0.2502 -0.1380 -0.1042 -0.2157 0.1012 0.0496 0.0958 0.0909 0.0956 0.0943 0.0975 0.0993 0.1424 0.1223 0.1396 0.1433 0.1401 0.1591 0.1496 0.1625 0.1511 0.1587 0.1482 0.1629 0.1600 0.1596
va: 1.2150 2.1521 2.0619 2.0746 3.1105 3.6155 3.8479 3.5706 3.9380 3.9262 4.2134 3.9962 4.0073 3.7539 3.9750 3.9528 3.7135 3.8878 3.9378 3.9607 3.7788 4.0314 3.8891 4.0064 3.6610 3.8682 4.0084 3.7945 3.8232 3.8573 1.0293 1.0196 1.0037 1.0104 1.0027 1.0026 1.0049 1.0006 1.0046 1.0101 1.0173 1.0061 1.0154 1.0063 1.0014 0.9879 1.0045 0.9966 1.0064 0.9898 0.9882 0.9911
dispcorr: -0.032534429 hartree
energy: -1706.675943061204
dipole: 8.49823 -8.63937 -0.14115 -3.89595 3.84796 -0.04799 -27.63188 24.32874 -3.30314
magnitude: 3.30650 au
magnitude: 8.40447 debye
