program: Gaussian 09
title: 000074690
version: EM64L-G09RevD.01
frameworkgroup: C1[X(C3H6OS)]
method: RPBEPBE
basis: SDD
operation: Freq
keyword: #pfreq=noraman
keyword: PBEPBE/SDD
title: #p freq=noraman PBEPBE/SDD
converged: YES YES NO NO
title: Mulliken charges:
elementType: S O C C C H H H H H H
charge: -0.041027 -0.155355 -0.380350 -0.656863 -0.088555 0.250111 0.249647 0.232710 0.232169 0.217270 0.140243
chargesum: 0.00000
title: Mulliken charges with hydrogens summed into heavy atoms:
elementType: S O C C C
charge: 0.099217 -0.155355 0.119408 0.025286 -0.088555
polarizability: 7.00197088e+01 -3.70626480e+00 5.26254924e+01 -5.85645281e-02 3.56995379e-03 3.08784872e+01
1716.lowfreq: -20.8964 -0.0013 0.0021 0.0040 3.5151 4.4259 19.0232 193.1108 212.7584
frequency: -5.8898 193.0660 212.7563 318.5093 327.3528 406.6414 480.9880 684.2503 774.2332 779.2183 953.8424 1028.8994 1071.7851 1093.6045 1242.4328 1323.3685 1398.4699 1436.0779 1472.7293 1480.2614 1664.0548 2450.0251 2989.3483 3001.6579 3035.9156 3100.1755 3105.4108
redmass: 2.0219 1.1163 3.7555 1.0588 4.6542 9.2289 2.7632 3.7907 1.3436 1.3334 2.5240 1.7087 1.5211 2.5015 1.1695 1.6446 1.2043 1.0881 1.0389 1.0497 9.2374 1.0381 1.0601 1.0364 1.0989 1.1005 1.1005
irintensity: 0.7523 0.0440 0.6642 40.7678 24.2844 4.6750 0.2072 41.6024 51.8321 11.7954 91.5873 49.1103 1.3168 35.6585 0.1653 19.3480 19.6360 32.1667 13.1479 13.0974 198.9343 8.3998 16.3239 20.0852 4.2273 23.5772 29.8768
temp: 298.150 k
press: 1.00000 atm
elementType: 16 8 6 6 6 1 1 1 1 1 1
symmnumber: 1
zpe: 215477.8 jmol-1
zpe.correction: 0.082071 hartree
zpe.thermalcorrener: 0.087814 hartree
zpe.thermalcorrenthalpy: 0.088759 hartree
zpe.thermalcorrgfe: 0.052773 hartree
zpe.sumelectzpe: -590.792478 hartree
zpe.sumelectthermal: -590.786735 hartree
zpe.sumelectthermalent: -590.785790 hartree
zpe.sumelectthermalfe: -590.821776 hartree
dipole: -0.6777 -1.5412 0.0099
dipole: 1.6837
quadrupole: -34.8355 -41.5974 -38.2770
quadrupole: 4.3728 -0.0039 -0.0100
quadrupole: 3.4011 -3.3607 -0.0403 4.3728 -0.0039 -0.0100
hfenergy: -590.874549 hartree
pointgroup: C01 [X(C3H6O1S1)]
dipole: 0.32902 0.5749053 0.0035966 debye
dipolederiv: -0.8348774 0.3402535 -0.0026139 0.3386358 -0.0520951 0.0004406 -0.0025442 0.0003272 -0.208794 -0.6508046 0.0609979 -0.0011407 0.5190897 -1.0801823 0.0019213 -0.0021201 0.0004804 -0.2260292 -0.2165449 -0.1249093 -0.0018349 -0.1560256 -0.1531901 -0.0024992 -0.0054671 -0.0036967 0.1557182 -0.0334782 0.03619 0.0006389 -0.0224722 0.0552683 -0.0001114 0.0005901 0.0006972 0.0746548 1.6220607 -0.2924745 0.0066955 -0.6819549 1.1833044 -0.0017284 0.0078542 -0.0000372 0.0368384 0.0105737 0.0379771 0.0526025 0.0436341 0.0534087 -0.0840031 0.0393711 -0.1030961 -0.009061 0.0105224 0.0411312 -0.0529868 0.0459792 0.049273 0.0853529 -0.0377136 0.1048457 -0.0043596 0.0862741 0.005807 0.0050451 0.0610337 0.02092 0.1106032 -0.0294835 0.10262 -0.0564682 0.0849576 0.0057431 -0.00535 0.0595947 0.0257563 -0.1091403 0.030594 -0.1012532 -0.0628312 -0.0960368 -0.1004554 -0.0008247 -0.1314024 -0.0216549 -0.0014623 -0.0009976 -0.0015982 0.1097169 0.0173534 -0.0102607 -0.000231 -0.0761121 -0.0808084 0.0006265 -0.0000833 0.0007108 0.190615 unknown
polarizability: 69.050266|-5.4458475|53.5948199|0.0841622|-0.0316561|30.8786025 unknown
InChI: InChI=1S/C3H6OS/c1-2-3(4)5/h5H,2H2,1H3
charge 0 multiplicity 1
11 atoms
S  -2.083021 0.71061 -0.00593
O  -0.350789 -1.433227 0.001555
C  0.744571 0.781865 0.005631
C  2.113591 0.078314 -0.006561
C  -0.428267 -0.191723 0.000653
H  0.637798 1.431817 0.896818
H  0.631201 1.451681 -0.869681
H  2.231591 -0.574969 0.874455
H  2.227569 -0.552379 -0.904461
H  2.924724 0.827113 0.000989
H  -2.845467 -0.444703 -0.003569
