program: Orca
programVersion: 5.0.2
elementType: Cl O O O N C C C C C C C C C C C C C C C C C C C C C C C C C H H H H H H H H H H H H H H H H H H H H H H
charge: 0
multiplicity: 1
keywords: wb97x-d3
keywords: def2-TZVPP
keywords: def2/J RIJCOSX
keywords: DEFGRID2
keywords: scfconv7
keywords: smallprint printgap noloewdin
keywords: NOSOSCF
formula: C25H22ClNO3
InChI: InChI=1/C25H22ClNO3/c1-17(2)24(18-11-13-20(26)14-12-18)25(28)30-23(16-27)19-7-6-10-22(15-19)29-21-8-4-3-5-9-21/h3-15,17,23-24H,1-2H3
52 atoms
Cl -0.324842 -3.414229 3.952175
O  2.395136 0.789021 -0.378174
O  1.340332 -0.273902 -2.036216
O  -3.443201 1.054513 -0.470961
N  2.471561 3.848693 0.852171
C  2.9705 -1.469627 -0.703563
C  3.244297 -2.475263 -1.829424
C  2.167833 -2.023762 0.459386
C  4.114415 -1.842799 -2.910685
C  3.926848 -3.717548 -1.270624
C  2.162699 -0.277873 -1.158408
C  0.904433 -2.573795 0.256225
C  2.651713 -1.926984 1.758462
C  1.417535 1.826113 -0.421384
C  0.137403 -3.012799 1.323159
C  1.897026 -2.36103 2.83893
C  0.135684 1.384043 0.245977
C  0.64031 -2.89537 2.609635
C  -1.060741 1.470898 -0.449666
C  0.177979 0.852885 1.530932
C  -2.231819 1.03912 0.162826
C  2.018655 2.947771 0.299278
C  -0.993791 0.399734 2.114349
C  -2.201748 0.497023 1.439647
C  -3.768668 2.068204 -1.338674
C  -4.482218 1.714983 -2.475022
C  -3.466466 3.398104 -1.07349
C  -4.899024 2.704453 -3.354072
C  -3.87749 4.374848 -1.969444
C  -4.593388 4.036334 -3.110248
H  3.929274 -1.113698 -0.314479
H  2.291786 -2.776577 -2.275132
H  3.653847 -0.965101 -3.365395
H  5.079809 -1.536969 -2.501255
H  4.307864 -2.556609 -3.712157
H  4.86545 -3.461386 -0.773682
H  4.159838 -4.416237 -2.075031
H  3.301795 -4.245731 -0.550466
H  0.496565 -2.658818 -0.74328
H  3.630822 -1.500867 1.938441
H  1.227954 2.158918 -1.446509
H  -0.844594 -3.431351 1.149502
H  2.287032 -2.275087 3.844043
H  -1.070829 1.866931 -1.457809
H  1.112812 0.787495 2.073218
H  -0.971708 -0.025648 3.10874
H  -3.118333 0.150448 1.899462
H  -4.71485 0.674809 -2.664892
H  -2.922061 3.678426 -0.180707
H  -5.459884 2.427465 -4.237054
H  -3.639692 5.410715 -1.766102
H  -4.913746 4.805047 -3.800492
elementType: Cl O N C H
totalener: -1706.64325993 hartree
nucrepener: 2965.52264041 hartree
electener: -4672.16590034 hartree
oneelecener: -8225.64564289 hartree
twoeener: 3553.47974255 hartree
cpcmener: -0.03683184 hartree
kineticenergy: 1700.52010429 hartree
xcener: -142.757214664852 hartree
chargesum: 0.0000000
charge: -0.101343 -0.276332 -0.440193 -0.336197 -0.098767 0.152969 0.059980 -0.003286 -0.294170 -0.311761 0.325625 -0.182701 -0.204356 0.407435 -0.183318 -0.145266 0.070392 0.116048 -0.196808 -0.291235 0.291062 -0.224152 -0.133519 -0.219041 0.296020 -0.258277 -0.198831 -0.121109 -0.142789 -0.192297 0.098878 0.046735 0.093693 0.089693 0.094419 0.091495 0.098145 0.097768 0.144734 0.141548 0.143094 0.144188 0.143694 0.149019 0.159546 0.156071 0.149329 0.148452 0.159719 0.162019 0.162368 0.161608
qa: -0.1013 -0.2763 -0.4402 -0.3362 -0.0988 0.1530 0.0600 -0.0033 -0.2942 -0.3118 0.3256 -0.1827 -0.2044 0.4074 -0.1833 -0.1453 0.0704 0.1160 -0.1968 -0.2912 0.2911 -0.2242 -0.1335 -0.2190 0.2960 -0.2583 -0.1988 -0.1211 -0.1428 -0.1923 0.0989 0.0467 0.0937 0.0897 0.0944 0.0915 0.0981 0.0978 0.1447 0.1415 0.1431 0.1442 0.1437 0.1490 0.1595 0.1561 0.1493 0.1485 0.1597 0.1620 0.1624 0.1616
va: 1.1998 2.1514 2.0533 2.0716 3.1100 3.6549 3.8127 3.4644 3.9288 3.9481 4.2683 3.9273 3.9808 3.7369 4.0010 3.9787 3.5352 3.7578 3.9570 3.9611 3.7253 4.0881 3.8772 4.0121 3.6711 4.0107 3.9122 3.8759 3.8819 3.9031 1.0375 1.0274 1.0129 1.0019 1.0042 1.0018 1.0042 1.0008 1.0146 1.0039 1.0159 1.0076 1.0056 1.0079 1.0009 0.9926 1.0047 1.0077 0.9960 0.9878 0.9892 0.9895
dispcorr: -0.031227176 hartree
energy: -1706.674487105775
dipole: 12.15403 -11.86408 0.28995 -3.75557 2.90715 -0.84842 -22.25168 21.41867 -0.83301
magnitude: 1.22385 au
magnitude: 3.11077 debye
