program: Orca
programVersion: 5.0.2
elementType: Cl O O O N C C C C C C C C C C C C C C C C C C C C C C C C C H H H H H H H H H H H H H H H H H H H H H H
charge: 0
multiplicity: 1
keywords: wb97x-d3
keywords: def2-TZVPP
keywords: def2/J RIJCOSX
keywords: DEFGRID2
keywords: scfconv7
keywords: smallprint printgap noloewdin
keywords: NOSOSCF
formula: C25H22ClNO3
InChI: InChI=1/C25H22ClNO3/c1-17(2)24(18-11-13-20(26)14-12-18)25(28)30-23(16-27)19-7-6-10-22(15-19)29-21-8-4-3-5-9-21/h3-15,17,23-24H,1-2H3
52 atoms
Cl -2.914838 -3.386765 -0.208773
O  2.243066 0.653091 1.050087
O  3.549046 0.492462 -0.752344
O  -2.176727 1.717733 -1.393574
N  1.288704 3.027325 3.130513
C  2.784789 -1.523493 0.376323
C  3.756319 -2.377634 -0.465821
C  1.335306 -1.93422 0.244148
C  3.883666 -3.766628 0.150201
C  3.393724 -2.493366 -1.941188
C  2.926526 -0.042173 0.125884
C  0.548138 -1.50981 -0.82452
C  0.769443 -2.789274 1.183861
C  2.172372 2.06171 0.868451
C  -0.763629 -1.936752 -0.96289
C  -0.538142 -3.234114 1.057358
C  1.227629 2.441368 -0.246157
C  -1.291891 -2.808096 -0.023426
C  -0.048514 1.89073 -0.263873
C  1.638841 3.322145 -1.234032
C  -0.921499 2.245957 -1.280947
C  1.686813 2.586933 2.145318
C  0.753932 3.664143 -2.247353
C  -0.525633 3.135276 -2.273547
C  -2.889341 1.364656 -0.271932
C  -2.941914 2.175268 0.855934
C  -3.613624 0.183773 -0.333037
C  -3.719943 1.781005 1.934761
C  -4.399128 -0.190453 0.748528
C  -4.45032 0.600147 1.887843
H  3.066556 -1.66541 1.42595
H  4.735519 -1.89517 -0.390712
H  4.188345 -3.717561 1.197044
H  2.942622 -4.317896 0.100947
H  4.632574 -4.352214 -0.384471
H  4.182719 -3.031549 -2.468605
H  3.277715 -1.527858 -2.4319
H  2.470215 -3.056199 -2.085367
H  0.95019 -0.840451 -1.575559
H  1.357179 -3.120973 2.030746
H  3.163383 2.492425 0.693228
H  -1.356969 -1.599338 -1.801792
H  -0.957078 -3.905596 1.794434
H  -0.353583 1.194183 0.507731
H  2.637756 3.738014 -1.212273
H  1.062015 4.351507 -3.023516
H  -1.216928 3.405034 -3.061559
H  -2.386485 3.103699 0.900772
H  -3.568016 -0.43277 -1.221459
H  -3.757027 2.408002 2.815935
H  -4.965309 -1.110856 0.698963
H  -5.056169 0.300153 2.732302
elementType: Cl O N C H
totalener: -1706.64189469 hartree
nucrepener: 3067.58998104 hartree
electener: -4774.23187572 hartree
oneelecener: -8430.02812451 hartree
twoeener: 3655.79624879 hartree
cpcmener: -0.03693586 hartree
kineticenergy: 1700.52926242 hartree
xcener: -142.761600506621 hartree
chargesum: 0.0000000
charge: -0.101134 -0.281376 -0.436074 -0.339760 -0.100482 0.132159 0.081094 0.088195 -0.329343 -0.317515 0.357566 -0.298834 -0.246827 0.419355 -0.156053 -0.118725 0.052279 0.093360 -0.277506 -0.210452 0.305607 -0.225830 -0.105611 -0.254702 0.317537 -0.200964 -0.280604 -0.144728 -0.107851 -0.190204 0.103106 0.050562 0.099114 0.088605 0.101444 0.106558 0.096213 0.085648 0.152083 0.150561 0.147548 0.153659 0.146364 0.150841 0.149851 0.162328 0.149482 0.155617 0.151227 0.162101 0.152995 0.161518
qa: -0.1011 -0.2814 -0.4361 -0.3398 -0.1005 0.1322 0.0811 0.0882 -0.3293 -0.3175 0.3576 -0.2988 -0.2468 0.4194 -0.1561 -0.1187 0.0523 0.0934 -0.2775 -0.2105 0.3056 -0.2258 -0.1056 -0.2547 0.3175 -0.2010 -0.2806 -0.1447 -0.1079 -0.1902 0.1031 0.0506 0.0991 0.0886 0.1014 0.1066 0.0962 0.0856 0.1521 0.1506 0.1475 0.1537 0.1464 0.1508 0.1499 0.1623 0.1495 0.1556 0.1512 0.1621 0.1530 0.1615
va: 1.2057 2.1357 2.0577 2.0649 3.1079 3.7316 3.8283 3.4198 3.9443 3.9334 4.2291 3.9452 4.0098 3.7282 3.9248 3.9787 3.5589 3.8221 3.9483 3.9736 3.6816 4.0929 3.8850 4.0300 3.6648 3.9138 3.9638 3.8853 3.8474 3.9354 1.0320 1.0227 1.0017 0.9996 1.0048 1.0045 1.0164 0.9970 0.9982 0.9977 1.0143 1.0009 1.0036 1.0046 1.0022 0.9876 1.0051 0.9978 1.0104 0.9888 1.0007 0.9893
dispcorr: -0.033398397 hartree
energy: -1706.675293082731
dipole: 18.22907 -17.20993 1.01914 -7.61347 6.95011 -0.66336 -4.39692 3.88628 -0.51064
magnitude: 1.31888 au
magnitude: 3.35233 debye
