program: Orca
programVersion: 5.0.2
elementType: Cl O O O N C C C C C C C C C C C C C C C C C C C C C C C C C H H H H H H H H H H H H H H H H H H H H H H
charge: 0
multiplicity: 1
keywords: wb97x-d3
keywords: def2-TZVPP
keywords: def2/J RIJCOSX
keywords: DEFGRID2
keywords: scfconv7
keywords: smallprint printgap noloewdin
keywords: NOSOSCF
formula: C25H22ClNO3
InChI: InChI=1/C25H22ClNO3/c1-17(2)24(18-11-13-20(26)14-12-18)25(28)30-23(16-27)19-7-6-10-22(15-19)29-21-8-4-3-5-9-21/h3-15,17,23-24H,1-2H3
52 atoms
Cl -2.579681 -2.381211 -1.553866
O  2.782275 0.626987 0.802048
O  3.976254 -0.001438 -0.991105
O  -2.246245 2.414366 0.988667
N  2.944416 3.61666 2.216179
C  3.048243 -1.678826 0.487507
C  4.07156 -2.731038 0.044807
C  1.638056 -1.909176 -0.02586
C  5.435445 -2.448619 0.665493
C  3.595109 -4.121839 0.445492
C  3.369295 -0.284267 0.00755
C  1.386543 -2.036021 -1.389903
C  0.564383 -1.931723 0.855954
C  2.531285 1.928387 0.267006
C  0.093827 -2.184969 -1.86626
C  -0.735589 -2.087572 0.397256
C  1.118259 1.962073 -0.25838
C  -0.95871 -2.203537 -0.964649
C  0.045286 2.166182 0.599403
C  0.896826 1.669367 -1.598697
C  -1.249487 2.109045 0.105222
C  2.757143 2.867853 1.363886
C  -0.40428 1.591242 -2.072895
C  -1.484255 1.81454 -1.232813
C  -3.485768 1.83189 0.879018
C  -3.638181 0.474436 0.63258
C  -4.588854 2.64382 1.096508
C  -4.913668 -0.069202 0.601545
C  -5.858924 2.08374 1.078424
C  -6.027801 0.72868 0.828238
H  3.011487 -1.669518 1.58112
H  4.168733 -2.699325 -1.044344
H  6.162237 -3.19692 0.347178
H  5.834184 -1.472912 0.385772
H  5.380487 -2.48568 1.75582
H  3.433893 -4.186069 1.524191
H  4.341207 -4.871215 0.178674
H  2.663384 -4.399341 -0.048022
H  2.200933 -2.014343 -2.103447
H  0.738048 -1.83174 1.919953
H  3.242133 2.177761 -0.525599
H  -0.085705 -2.277908 -2.928714
H  -1.55855 -2.116171 1.098864
H  0.199468 2.385088 1.649868
H  1.730834 1.50304 -2.267719
H  -0.583321 1.365936 -3.115546
H  -2.491168 1.771968 -1.627148
H  -2.773024 -0.156017 0.476434
H  -4.454117 3.70092 1.287689
H  -5.031229 -1.127608 0.408857
H  -6.719446 2.715637 1.254515
H  -7.019715 0.297644 0.809052
elementType: Cl O N C H
totalener: -1706.64186299 hartree
nucrepener: 3032.45137830 hartree
electener: -4739.09324129 hartree
oneelecener: -8359.21472052 hartree
twoeener: 3620.12147923 hartree
cpcmener: -0.03559509 hartree
kineticenergy: 1700.52419235 hartree
xcener: -142.758038286197 hartree
chargesum: 0.0000000
charge: -0.096109 -0.277585 -0.436831 -0.334116 -0.099714 0.136290 0.063606 0.007825 -0.294757 -0.310498 0.345067 -0.201296 -0.211467 0.412790 -0.177010 -0.149173 0.021968 0.117909 -0.247912 -0.201674 0.293412 -0.221776 -0.144693 -0.189372 0.220228 -0.098846 -0.212006 -0.174223 -0.152032 -0.157647 0.100460 0.045755 0.093877 0.094283 0.089748 0.091198 0.097498 0.098155 0.145063 0.142593 0.138231 0.145439 0.151652 0.128159 0.151593 0.163627 0.155184 0.117694 0.148144 0.149266 0.161151 0.160872
qa: -0.0961 -0.2776 -0.4368 -0.3341 -0.0997 0.1363 0.0636 0.0078 -0.2948 -0.3105 0.3451 -0.2013 -0.2115 0.4128 -0.1770 -0.1492 0.0220 0.1179 -0.2479 -0.2017 0.2934 -0.2218 -0.1447 -0.1894 0.2202 -0.0988 -0.2120 -0.1742 -0.1520 -0.1576 0.1005 0.0458 0.0939 0.0943 0.0897 0.0912 0.0975 0.0982 0.1451 0.1426 0.1382 0.1454 0.1517 0.1282 0.1516 0.1636 0.1552 0.1177 0.1481 0.1493 0.1612 0.1609
va: 1.2131 2.1297 2.0547 2.0783 3.1071 3.6426 3.8123 3.4381 3.9288 3.9472 4.2416 3.9505 3.9853 3.7207 3.9912 3.8996 3.6624 3.7585 4.0803 3.8737 3.7423 4.0786 3.8518 3.8720 3.7860 3.8537 3.9609 3.9136 3.9026 3.8991 1.0367 1.0270 1.0043 1.0129 1.0019 1.0020 1.0044 1.0009 1.0136 1.0052 1.0225 1.0061 0.9981 1.0284 1.0084 0.9901 0.9970 0.9980 1.0066 1.0052 0.9883 0.9895
dispcorr: -0.033342658 hartree
energy: -1706.675205651488
dipole: 15.12843 -15.76626 -0.63784 -14.10084 12.33919 -1.76166 3.01171 -3.98231 -0.97060
magnitude: 2.11006 au
magnitude: 5.36334 debye
