program: Orca
programVersion: 5.0.2
elementType: Cl O O O N C C C C C C C C C C C C C C C C C C C C C C C C C H H H H H H H H H H H H H H H H H H H H H H
charge: 0
multiplicity: 1
keywords: wb97x-d3
keywords: def2-TZVPP
keywords: def2/J RIJCOSX
keywords: DEFGRID2
keywords: scfconv7
keywords: smallprint printgap noloewdin
keywords: NOSOSCF
formula: C25H22ClNO3
InChI: InChI=1/C25H22ClNO3/c1-17(2)24(18-11-13-20(26)14-12-18)25(28)30-23(16-27)19-7-6-10-22(15-19)29-21-8-4-3-5-9-21/h3-15,17,23-24H,1-2H3
52 atoms
Cl -2.600544 -3.116072 0.085372
O  2.844906 0.710339 0.852288
O  3.436285 0.394257 -1.279464
O  -2.20817 0.656184 0.254227
N  2.211358 3.26982 2.838788
C  3.210244 -1.513981 0.199012
C  4.116098 -2.377552 -0.689447
C  1.74683 -1.913711 0.165495
C  5.577216 -1.974893 -0.517089
C  3.939247 -3.852347 -0.347481
C  3.217971 -0.054925 -0.185136
C  1.024303 -1.881824 -1.024887
C  1.093652 -2.292716 1.332247
C  2.43561 2.039722 0.545602
C  -0.31505 -2.237381 -1.056428
C  -0.245741 -2.654051 1.318688
C  1.11208 2.046736 -0.181161
C  -0.937159 -2.627027 0.119376
C  0.025332 1.379462 0.375327
C  0.993453 2.695893 -1.399803
C  -1.179389 1.362504 -0.306392
C  2.317303 2.711916 1.838978
C  -0.222383 2.669981 -2.070042
C  -1.310329 2.000647 -1.53557
C  -3.474619 1.186305 0.236603
C  -3.709758 2.533585 0.482377
C  -4.527812 0.310842 0.016543
C  -5.015933 3.000807 0.494477
C  -5.829584 0.790996 0.042488
C  -6.080272 2.136343 0.274403
H  3.558279 -1.599232 1.233154
H  3.828477 -2.230011 -1.734867
H  5.764525 -0.933871 -0.781224
H  5.898716 -2.119047 0.516765
H  6.219309 -2.588736 -1.149877
H  2.926698 -4.206107 -0.542164
H  4.163128 -4.042033 0.704769
H  4.618002 -4.463166 -0.943907
H  1.501592 -1.58054 -1.949277
H  1.635296 -2.316282 2.269458
H  3.196478 2.571679 -0.033508
H  -0.86162 -2.211776 -1.989187
H  -0.736096 -2.956862 2.233813
H  0.106095 0.873923 1.331043
H  1.84285 3.213141 -1.826352
H  -0.320562 3.164971 -3.026643
H  -2.248439 1.974293 -2.075093
H  -2.890185 3.216499 0.666746
H  -4.329819 -0.736818 -0.169948
H  -5.19912 4.050358 0.683604
H  -6.649735 0.106164 -0.128223
H  -7.095956 2.508001 0.286752
elementType: Cl O N C H
totalener: -1706.64369774 hartree
nucrepener: 3027.77895981 hartree
electener: -4734.42265755 hartree
oneelecener: -8350.82922181 hartree
twoeener: 3616.40656426 hartree
cpcmener: -0.03745684 hartree
kineticenergy: 1700.53426329 hartree
xcener: -142.759229393781 hartree
chargesum: -0.0000000
charge: -0.105588 -0.280273 -0.438724 -0.334970 -0.098892 0.143429 0.063086 -0.027353 -0.293235 -0.313632 0.330414 -0.167908 -0.186320 0.430594 -0.196204 -0.152298 0.064253 0.135158 -0.292020 -0.187844 0.228954 -0.230834 -0.119627 -0.180842 0.277644 -0.171523 -0.248118 -0.159141 -0.148255 -0.177622 0.100012 0.046231 0.094075 0.089866 0.093591 0.097299 0.091499 0.098627 0.144803 0.141397 0.145299 0.144216 0.144585 0.142774 0.150440 0.163966 0.162821 0.157045 0.145527 0.161671 0.161108 0.160842
qa: -0.1056 -0.2803 -0.4387 -0.3350 -0.0989 0.1434 0.0631 -0.0274 -0.2932 -0.3136 0.3304 -0.1679 -0.1863 0.4306 -0.1962 -0.1523 0.0643 0.1352 -0.2920 -0.1878 0.2290 -0.2308 -0.1196 -0.1808 0.2776 -0.1715 -0.2481 -0.1591 -0.1483 -0.1776 0.1000 0.0462 0.0941 0.0899 0.0936 0.0973 0.0915 0.0986 0.1448 0.1414 0.1453 0.1442 0.1446 0.1428 0.1504 0.1640 0.1628 0.1570 0.1455 0.1617 0.1611 0.1608
va: 1.1972 2.1498 2.0547 2.0223 3.1100 3.6710 3.8090 3.4584 3.9282 3.9502 4.2536 3.9040 3.9840 3.7078 4.0036 4.0136 3.5352 3.7337 4.0444 3.9602 3.7060 4.0959 3.8982 3.9515 3.6855 3.8985 3.9760 3.8963 3.9352 3.8900 1.0375 1.0270 1.0134 1.0017 1.0045 1.0004 1.0017 1.0045 1.0138 1.0035 1.0124 1.0068 1.0059 1.0200 1.0027 0.9886 0.9934 0.9968 1.0244 0.9894 0.9895 0.9890
dispcorr: -0.032303867 hartree
energy: -1706.676001609242
dipole: 17.82121 -17.52201 0.29919 -5.21018 4.77032 -0.43985 -6.63832 5.39219 -1.24613
magnitude: 1.35493 au
magnitude: 3.44395 debye
