program: Orca
programVersion: 5.0.2
elementType: Cl O O O N C C C C C C C C C C C C C C C C C C C C C C C C C H H H H H H H H H H H H H H H H H H H H H H
charge: 0
multiplicity: 1
keywords: wb97x-d3
keywords: def2-TZVPP
keywords: def2/J RIJCOSX
keywords: DEFGRID2
keywords: scfconv7
keywords: smallprint printgap noloewdin
keywords: NOSOSCF
formula: C25H22ClNO3
InChI: InChI=1/C25H22ClNO3/c1-17(2)24(18-11-13-20(26)14-12-18)25(28)30-23(16-27)19-7-6-10-22(15-19)29-21-8-4-3-5-9-21/h3-15,17,23-24H,1-2H3
52 atoms
Cl -2.665804 -2.810779 1.080439
O  2.94088 0.68518 0.67735
O  3.23258 0.268403 -1.497704
O  -2.071691 0.779879 0.189962
N  2.544774 3.254182 2.68852
C  3.147434 -1.57391 0.080861
C  3.85814 -2.514035 -0.90219
C  1.688472 -1.911982 0.319691
C  5.339951 -2.168779 -1.006803
C  3.693596 -3.961957 -0.454252
C  3.144655 -0.132103 -0.367227
C  0.770833 -1.908694 -0.728102
C  1.235533 -2.193019 1.602766
C  2.598176 2.034214 0.377934
C  -0.568751 -2.184631 -0.50355
C  -0.101271 -2.473726 1.845201
C  1.243373 2.138017 -0.283091
C  -0.993022 -2.464908 0.786209
C  0.16477 1.454048 0.262686
C  1.089704 2.902338 -1.430334
C  -1.072085 1.525327 -0.36122
C  2.579662 2.707303 1.677286
C  -0.156693 2.973507 -2.034949
C  -1.241076 2.284105 -1.514384
C  -3.380794 1.158179 0.009597
C  -4.255279 0.240074 -0.549697
C  -3.823702 2.404882 0.431381
C  -5.59696 0.57449 -0.679763
C  -5.164342 2.729282 0.287267
C  -6.054821 1.817513 -0.266556
H  3.665256 -1.628675 1.04376
H  3.399418 -2.404696 -1.889554
H  5.515919 -1.153729 -1.363174
H  5.830712 -2.270699 -0.036181
H  5.840618 -2.845249 -1.700723
H  4.234263 -4.630005 -1.125701
H  2.650677 -4.279021 -0.448722
H  4.092784 -4.110709 0.551862
H  1.091648 -1.687029 -1.738674
H  1.93258 -2.196511 2.431392
H  3.363861 2.514653 -0.23946
H  -1.270405 -2.173652 -1.326611
H  -0.436992 -2.692603 2.849679
H  0.273264 0.859127 1.162775
H  1.935045 3.430683 -1.851427
H  -0.285761 3.559535 -2.934889
H  -2.199957 2.33477 -2.013501
H  -3.893184 -0.727657 -0.872009
H  -3.133196 3.112984 0.872887
H  -6.283512 -0.141563 -1.111935
H  -5.513855 3.698828 0.616588
H  -7.100184 2.074896 -0.372225
elementType: Cl O N C H
totalener: -1706.64342240 hartree
nucrepener: 3034.30927801 hartree
electener: -4740.95270040 hartree
oneelecener: -8363.99709179 hartree
twoeener: 3623.04439139 hartree
cpcmener: -0.03811521 hartree
kineticenergy: 1700.53726795 hartree
xcener: -142.760313451770 hartree
chargesum: 0.0000000
charge: -0.100535 -0.276587 -0.437079 -0.321805 -0.099491 0.135145 0.064898 -0.052195 -0.293566 -0.313329 0.331899 -0.134829 -0.181609 0.415823 -0.216645 -0.155534 0.059756 0.131647 -0.300654 -0.202376 0.262499 -0.227407 -0.129700 -0.192093 0.262625 -0.224861 -0.182064 -0.142886 -0.148726 -0.171790 0.100810 0.045578 0.093748 0.089580 0.093775 0.099004 0.097380 0.091539 0.145778 0.141660 0.147453 0.150799 0.144286 0.146267 0.149385 0.163709 0.158854 0.136562 0.160338 0.161647 0.161824 0.161495
qa: -0.1005 -0.2766 -0.4371 -0.3218 -0.0995 0.1351 0.0649 -0.0522 -0.2936 -0.3133 0.3319 -0.1348 -0.1816 0.4158 -0.2166 -0.1555 0.0598 0.1316 -0.3007 -0.2024 0.2625 -0.2274 -0.1297 -0.1921 0.2626 -0.2249 -0.1821 -0.1429 -0.1487 -0.1718 0.1008 0.0456 0.0937 0.0896 0.0938 0.0990 0.0974 0.0915 0.1458 0.1417 0.1475 0.1508 0.1443 0.1463 0.1494 0.1637 0.1589 0.1366 0.1603 0.1616 0.1618 0.1615
va: 1.2055 2.1469 2.0571 2.0469 3.1084 3.6762 3.8125 3.4685 3.9286 3.9499 4.2413 3.8930 3.9909 3.7182 3.9794 4.0198 3.5606 3.7674 4.0483 3.9623 3.7324 4.0968 3.9096 3.9302 3.6806 3.9720 3.9442 3.9106 3.8893 3.8922 1.0364 1.0265 1.0141 1.0015 1.0044 1.0045 1.0004 1.0017 1.0131 1.0038 1.0114 1.0000 1.0060 1.0141 1.0015 0.9889 0.9973 1.0196 0.9956 0.9899 0.9889 0.9888
dispcorr: -0.032652489 hartree
energy: -1706.676074885679
dipole: 16.59241 -16.49900 0.09341 -7.00951 6.51357 -0.49594 -11.06548 9.67075 -1.39474
magnitude: 1.48323 au
magnitude: 3.77008 debye
