program: Orca
programVersion: 5.0.2
elementType: Cl O O O N C C C C C C C C C C C C C C C C C C C C C C C C C H H H H H H H H H H H H H H H H H H H H H H
charge: 0
multiplicity: 1
keywords: wb97x-d3
keywords: def2-TZVPP
keywords: def2/J RIJCOSX
keywords: DEFGRID2
keywords: scfconv7
keywords: smallprint printgap noloewdin
keywords: NOSOSCF
formula: C25H22ClNO3
InChI: InChI=1/C25H22ClNO3/c1-17(2)24(18-11-13-20(26)14-12-18)25(28)30-23(16-27)19-7-6-10-22(15-19)29-21-8-4-3-5-9-21/h3-15,17,23-24H,1-2H3
52 atoms
Cl -2.808492 -2.446654 -1.919738
O  2.25835 0.632934 1.055064
O  3.753273 0.256327 -0.565643
O  -2.610586 2.038989 -0.612755
N  1.635793 3.349512 2.849236
C  2.652002 -1.620162 0.497274
C  3.731248 -2.570268 -0.047431
C  1.285205 -1.8393 -0.122773
C  5.036675 -2.402864 0.723245
C  3.270588 -4.02053 0.034624
C  2.991776 -0.166608 0.263539
C  1.010553 -1.423326 -1.423229
C  0.280392 -2.477026 0.59731
C  2.151191 2.006965 0.669792
C  -0.243978 -1.608341 -1.983997
C  -0.971837 -2.694795 0.042448
C  1.050941 2.146172 -0.353695
C  -1.226861 -2.243951 -1.242979
C  -0.278535 2.056261 0.045802
C  1.380385 2.254817 -1.697658
C  -1.279116 2.061515 -0.914854
C  1.862387 2.742777 1.899121
C  0.367699 2.257554 -2.647134
C  -0.958086 2.150345 -2.265117
C  -3.072103 1.476668 0.553239
C  -4.091527 2.145093 1.21486
C  -2.600127 0.258098 1.021421
C  -4.642824 1.582961 2.358207
C  -3.15029 -0.285669 2.172328
C  -4.172281 0.371248 2.845504
H  2.559674 -1.780985 1.576578
H  3.903116 -2.327099 -1.100481
H  4.899838 -2.667422 1.774174
H  5.806318 -3.060507 0.317219
H  5.428633 -1.386697 0.6858
H  4.061124 -4.684424 -0.317675
H  2.388697 -4.213547 -0.575865
H  3.036211 -4.305302 1.062968
H  1.773301 -0.942635 -2.023072
H  0.472832 -2.812595 1.608695
H  3.097596 2.38767 0.276691
H  -0.445043 -1.259381 -2.987772
H  -1.74309 -3.188835 0.618081
H  -0.526802 1.990836 1.098287
H  2.414596 2.333207 -2.004242
H  0.614298 2.336154 -3.697231
H  -1.74667 2.149236 -3.006832
H  -4.455482 3.09094 0.834146
H  -1.808024 -0.264966 0.503269
H  -5.441166 2.102144 2.872026
H  -2.776453 -1.233098 2.539038
H  -4.599455 -0.058953 3.741371
elementType: Cl O N C H
totalener: -1706.64260019 hartree
nucrepener: 3087.19721934 hartree
electener: -4793.83981953 hartree
oneelecener: -8468.85694448 hartree
twoeener: 3675.01712496 hartree
cpcmener: -0.03614622 hartree
kineticenergy: 1700.52133023 hartree
xcener: -142.759754313545 hartree
chargesum: -0.0000000
charge: -0.097569 -0.275956 -0.437152 -0.328921 -0.099289 0.132398 0.069709 -0.069084 -0.293297 -0.317387 0.343947 -0.166890 -0.097629 0.418173 -0.234509 -0.247974 0.016964 0.202583 -0.213883 -0.210817 0.308611 -0.229680 -0.096391 -0.265114 0.293053 -0.236541 -0.174813 -0.131631 -0.153610 -0.174917 0.102413 0.043592 0.088394 0.094049 0.093576 0.101245 0.095871 0.091439 0.152189 0.144476 0.138390 0.141738 0.143051 0.143662 0.146649 0.161290 0.146371 0.146901 0.113791 0.160941 0.157284 0.160304
qa: -0.0976 -0.2760 -0.4372 -0.3289 -0.0993 0.1324 0.0697 -0.0691 -0.2933 -0.3174 0.3439 -0.1669 -0.0976 0.4182 -0.2345 -0.2480 0.0170 0.2026 -0.2139 -0.2108 0.3086 -0.2297 -0.0964 -0.2651 0.2931 -0.2365 -0.1748 -0.1316 -0.1536 -0.1749 0.1024 0.0436 0.0884 0.0940 0.0936 0.1012 0.0959 0.0914 0.1522 0.1445 0.1384 0.1417 0.1431 0.1437 0.1466 0.1613 0.1464 0.1469 0.1138 0.1609 0.1573 0.1603
va: 1.2098 2.1486 2.0506 2.0883 3.1078 3.7073 3.8051 3.5450 3.9295 3.9548 4.2244 3.8912 3.8640 3.7329 4.0107 4.0149 3.6292 3.6630 3.9502 3.9020 3.6958 4.0857 3.8681 3.9790 3.7050 3.9831 3.8361 3.8803 3.8992 3.9040 1.0328 1.0286 1.0016 1.0043 1.0141 1.0046 0.9996 1.0013 1.0100 1.0004 1.0185 1.0115 1.0098 1.0083 1.0122 0.9875 1.0079 1.0075 1.0140 0.9880 0.9927 0.9900
dispcorr: -0.034423603 hartree
energy: -1706.677023790073
dipole: 19.72436 -19.18581 0.53855 -12.93472 11.50393 -1.43080 6.12327 -6.63381 -0.51054
magnitude: 1.61179 au
magnitude: 4.09684 debye
