program: Orca
programVersion: 5.0.2
elementType: Cl O O O N C C C C C C C C C C C C C C C C C C C C C C C C C H H H H H H H H H H H H H H H H H H H H H H
charge: 0
multiplicity: 1
keywords: wb97x-d3
keywords: def2-TZVPP
keywords: def2/J RIJCOSX
keywords: DEFGRID2
keywords: scfconv7
keywords: smallprint printgap noloewdin
keywords: NOSOSCF
formula: C25H22ClNO3
InChI: InChI=1/C25H22ClNO3/c1-17(2)24(18-11-13-20(26)14-12-18)25(28)30-23(16-27)19-7-6-10-22(15-19)29-21-8-4-3-5-9-21/h3-15,17,23-24H,1-2H3
52 atoms
Cl -2.679033 -1.946273 1.585401
O  3.126936 0.729671 0.118248
O  2.998955 -0.152987 -1.939484
O  -2.011154 0.822483 -1.176193
N  4.002728 3.872364 0.76189
C  3.123162 -1.613162 -0.014534
C  3.707099 -2.765087 -0.840383
C  1.670096 -1.775661 0.397846
C  5.183873 -2.516753 -1.129491
C  3.531402 -4.08783 -0.104482
C  3.108543 -0.293743 -0.752257
C  0.696891 -2.15352 -0.523903
C  1.27228 -1.452028 1.689973
C  2.558583 1.973906 -0.298198
C  -0.63944 -2.2235 -0.163263
C  -0.061188 -1.50922 2.065624
C  1.124016 1.995711 0.164093
C  -1.008077 -1.893564 1.131314
C  0.154244 1.528823 -0.711306
C  0.787162 2.326016 1.471606
C  -1.153497 1.364054 -0.271672
C  3.374326 3.027722 0.303548
C  -0.524761 2.1749 1.890864
C  -1.499984 1.681902 1.035806
C  -3.367543 0.980117 -1.077744
C  -4.145327 -0.146568 -1.300962
C  -3.957113 2.21664 -0.847656
C  -5.527756 -0.03445 -1.292622
C  -5.341548 2.310794 -0.826057
C  -6.131697 1.190829 -1.047608
H  3.721854 -1.49857 0.894292
H  3.176159 -2.828205 -1.794673
H  5.354619 -1.595466 -1.688278
H  5.760202 -2.455448 -0.203351
H  5.600817 -3.332591 -1.7219
H  2.48241 -4.34532 0.043899
H  4.009478 -4.060981 0.877757
H  3.987708 -4.90164 -0.670173
H  0.969529 -2.396114 -1.543428
H  2.010666 -1.146544 2.421034
H  2.620878 2.095454 -1.383436
H  -1.382123 -2.522431 -0.890607
H  -0.35245 -1.248763 3.0742
H  0.409904 1.270246 -1.731969
H  1.53461 2.689868 2.165571
H  -0.794376 2.425277 2.90837
H  -2.509286 1.542678 1.399266
H  -3.670194 -1.100898 -1.488104
H  -3.351593 3.100818 -0.691716
H  -6.132827 -0.913968 -1.470874
H  -5.802853 3.27258 -0.64259
H  -7.210414 1.273967 -1.033802
elementType: Cl O N C H
totalener: -1706.65432955 hartree
nucrepener: 3071.14927197 hartree
electener: -4777.80360152 hartree
oneelecener: -8436.98516250 hartree
twoeener: 3659.18156097 hartree
cpcmener: -0.03051891 hartree
kineticenergy: 1700.54650723 hartree
xcener: -142.763514492840 hartree
chargesum: -0.0000000
charge: -0.099914 -0.274401 -0.413165 -0.315559 -0.086075 0.126368 0.060683 0.031439 -0.297091 -0.303661 0.322387 -0.213794 -0.207392 0.382383 -0.173843 -0.185203 0.056199 0.156284 -0.287059 -0.209844 0.352538 -0.224719 -0.130784 -0.224352 0.312024 -0.266726 -0.211781 -0.119007 -0.142503 -0.180311 0.099732 0.044253 0.096214 0.088889 0.093807 0.099188 0.090593 0.095781 0.143827 0.137443 0.135523 0.147611 0.141247 0.131187 0.136773 0.158400 0.147147 0.148608 0.156717 0.156964 0.159149 0.157825
qa: -0.0999 -0.2744 -0.4132 -0.3156 -0.0861 0.1264 0.0607 0.0314 -0.2971 -0.3037 0.3224 -0.2138 -0.2074 0.3824 -0.1738 -0.1852 0.0562 0.1563 -0.2871 -0.2098 0.3525 -0.2247 -0.1308 -0.2244 0.3120 -0.2667 -0.2118 -0.1190 -0.1425 -0.1803 0.0997 0.0443 0.0962 0.0889 0.0938 0.0992 0.0906 0.0958 0.1438 0.1374 0.1355 0.1476 0.1412 0.1312 0.1368 0.1584 0.1471 0.1486 0.1567 0.1570 0.1591 0.1578
va: 1.2061 2.1299 2.0847 2.0534 3.1100 3.6523 3.8133 3.4741 3.9325 3.9431 4.2741 3.9804 3.9826 3.7596 3.9561 3.9555 3.6147 3.7362 4.0066 3.9720 3.5746 4.0704 3.9124 3.8999 3.6597 3.9737 3.9292 3.8998 3.8838 3.9115 1.0338 1.0283 1.0116 1.0026 1.0040 1.0016 1.0022 1.0048 1.0104 1.0087 1.0240 1.0001 1.0070 1.0309 1.0112 0.9911 1.0089 1.0078 0.9977 0.9908 0.9899 0.9902
dispcorr: -0.034732683 hartree
energy: -1706.689062235502
dipole: 13.43855 -14.50274 -1.06420 -12.73707 11.53602 -1.20106 -5.28532 5.66368 0.37836
magnitude: 1.64870 au
magnitude: 4.19065 debye
