program: Orca
programVersion: 5.0.2
elementType: Cl O O O N C C C C C C C C C C C C C C C C C C C C C C C C C H H H H H H H H H H H H H H H H H H H H H H
charge: 0
multiplicity: 1
keywords: wb97x-d3
keywords: def2-TZVPP
keywords: def2/J RIJCOSX
keywords: DEFGRID2
keywords: scfconv7
keywords: smallprint printgap noloewdin
keywords: NOSOSCF
formula: C25H22ClNO3
InChI: InChI=1/C25H22ClNO3/c1-17(2)24(18-11-13-20(26)14-12-18)25(28)30-23(16-27)19-7-6-10-22(15-19)29-21-8-4-3-5-9-21/h3-15,17,23-24H,1-2H3
52 atoms
Cl -2.687349 -2.578722 -0.753005
O  2.908149 0.743587 0.822666
O  3.777226 0.13679 -1.146792
O  -2.139896 0.807801 0.787438
N  2.540581 3.709196 2.269324
C  3.13454 -1.566396 0.445917
C  4.099195 -2.591189 -0.166668
C  1.671559 -1.838979 0.144264
C  5.534451 -2.298999 0.257084
C  3.708224 -4.003555 0.250689
C  3.356047 -0.162293 -0.062597
C  0.767107 -2.07357 1.173359
C  1.201353 -1.829055 -1.166995
C  2.510338 2.007551 0.290536
C  -0.57536 -2.30607 0.909902
C  -0.136131 -2.0555 -1.447264
C  1.13647 1.862626 -0.315175
C  -1.014851 -2.294607 -0.402949
C  0.0731 1.49287 0.500701
C  0.961603 1.983687 -1.685321
C  -1.164871 1.233284 -0.06274
C  2.527783 2.943492 1.413683
C  -0.286778 1.724707 -2.236345
C  -1.350695 1.338627 -1.438277
C  -3.446501 1.17043 0.606723
C  -4.407408 0.228743 0.947933
C  -3.819084 2.436737 0.172089
C  -5.751227 0.555085 0.842824
C  -5.167883 2.743997 0.060154
C  -6.138921 1.808917 0.391098
H  3.262757 -1.569488 1.532824
H  4.034198 -2.525057 -1.256996
H  5.645708 -2.382425 1.340888
H  6.222151 -3.013454 -0.197929
H  5.868088 -1.302344 -0.035209
H  2.720907 -4.286449 -0.115541
H  3.703867 -4.109115 1.338393
H  4.420993 -4.728037 -0.146109
H  1.109515 -2.078647 2.200892
H  1.875699 -1.642301 -1.993402
H  3.225122 2.377763 -0.450107
H  -1.264721 -2.49114 1.72265
H  -0.485157 -2.040742 -2.470958
H  0.197482 1.392008 1.57315
H  1.791098 2.267823 -2.319719
H  -0.429085 1.805841 -3.305805
H  -2.309508 1.114463 -1.887932
H  -4.103071 -0.750091 1.294875
H  -3.074631 3.183387 -0.07422
H  -6.497806 -0.18199 1.108991
H  -5.457247 3.729166 -0.282493
H  -7.188353 2.057033 0.301807
elementType: Cl O N C H
totalener: -1706.65586265 hartree
nucrepener: 3067.58117733 hartree
electener: -4774.23703998 hartree
oneelecener: -8430.08516779 hartree
twoeener: 3655.84812781 hartree
cpcmener: -0.03069843 hartree
kineticenergy: 1700.55091388 hartree
xcener: -142.763360643661 hartree
chargesum: 0.0000000
charge: -0.098434 -0.281085 -0.412286 -0.317876 -0.085053 0.136638 0.062272 -0.034397 -0.291290 -0.311278 0.318932 -0.157818 -0.193625 0.422445 -0.164482 -0.192263 0.065074 0.146709 -0.302984 -0.189543 0.295068 -0.240254 -0.111750 -0.205955 0.317258 -0.265960 -0.203885 -0.121906 -0.147504 -0.186597 0.095985 0.045701 0.087837 0.094033 0.094565 0.097489 0.089820 0.098443 0.136937 0.141196 0.135049 0.142560 0.142440 0.129469 0.143875 0.159139 0.153814 0.136428 0.154684 0.157011 0.158089 0.157264
qa: -0.0984 -0.2811 -0.4123 -0.3179 -0.0851 0.1366 0.0623 -0.0344 -0.2913 -0.3113 0.3189 -0.1578 -0.1936 0.4224 -0.1645 -0.1923 0.0651 0.1467 -0.3030 -0.1895 0.2951 -0.2403 -0.1117 -0.2060 0.3173 -0.2660 -0.2039 -0.1219 -0.1475 -0.1866 0.0960 0.0457 0.0878 0.0940 0.0946 0.0975 0.0898 0.0984 0.1369 0.1412 0.1350 0.1426 0.1424 0.1295 0.1439 0.1591 0.1538 0.1364 0.1547 0.1570 0.1581 0.1573
va: 1.2107 2.1471 2.0832 2.0340 3.1128 3.6704 3.8065 3.4968 3.9272 3.9500 4.2829 3.9538 3.9266 3.7359 3.9520 3.9965 3.5564 3.7417 4.0956 3.9430 3.6220 4.0884 3.8856 3.9099 3.6628 3.9910 3.9188 3.9150 3.8926 3.9131 1.0386 1.0273 1.0022 1.0045 1.0123 1.0005 1.0021 1.0046 1.0041 1.0195 1.0184 1.0039 1.0079 1.0312 1.0080 0.9900 1.0020 1.0224 0.9994 0.9906 0.9906 0.9905
dispcorr: -0.034474394 hartree
energy: -1706.690337047140
dipole: 16.34580 -16.59230 -0.24650 -9.73285 8.65232 -1.08053 -1.11872 0.04033 -1.07839
magnitude: 1.54636 au
magnitude: 3.93052 debye
