program: Orca
programVersion: 5.0.2
elementType: Cl O O O N C C C C C C C C C C C C C C C C C C C C C C C C C H H H H H H H H H H H H H H H H H H H H H H
charge: 0
multiplicity: 1
keywords: wb97x-d3
keywords: def2-TZVPP
keywords: def2/J RIJCOSX
keywords: DEFGRID2
keywords: scfconv7
keywords: smallprint printgap noloewdin
keywords: NOSOSCF
formula: C25H22ClNO3
InChI: InChI=1/C25H22ClNO3/c1-17(2)24(18-11-13-20(26)14-12-18)25(28)30-23(16-27)19-7-6-10-22(15-19)29-21-8-4-3-5-9-21/h3-15,17,23-24H,1-2H3
52 atoms
Cl -2.462363 -3.28356 0.616459
O  2.845448 0.791981 0.796177
O  3.569892 0.484989 -1.294327
O  -2.152567 0.872521 0.322783
N  2.40644 3.364061 2.808033
C  3.259489 -1.424938 0.180401
C  4.160804 -2.317138 -0.700169
C  1.817913 -1.881402 0.276606
C  4.467081 -3.61528 0.038159
C  3.613474 -2.626353 -2.088291
C  3.268442 0.029062 -0.225616
C  0.891487 -1.599148 -0.72626
C  1.388859 -2.601119 1.387353
C  2.501458 2.14104 0.501638
C  -0.424242 -2.023445 -0.627658
C  0.077641 -3.039785 1.500034
C  1.163306 2.207626 -0.194302
C  -0.81993 -2.743701 0.487669
C  0.072548 1.573137 0.38697
C  1.03763 2.854168 -1.414858
C  -1.147055 1.572171 -0.271392
C  2.451452 2.814438 1.80043
C  -0.19242 2.852734 -2.057834
C  -1.285554 2.207125 -1.501969
C  -3.46025 1.234664 0.129697
C  -3.885928 2.547257 0.294796
C  -4.362585 0.227275 -0.175837
C  -5.232169 2.844452 0.141318
C  -5.708167 0.537573 -0.316363
C  -6.147414 1.845343 -0.165155
H  3.674779 -1.455224 1.193094
H  5.104528 -1.775281 -0.820501
H  4.913984 -3.429217 1.01674
H  3.566544 -4.214107 0.189812
H  5.169658 -4.22433 -0.533006
H  4.364205 -3.174068 -2.660875
H  3.364266 -1.732455 -2.658469
H  2.723708 -3.256659 -2.041591
H  1.180244 -1.035953 -1.605083
H  2.086225 -2.823134 2.185891
H  3.273345 2.632563 -0.098489
H  -1.128241 -1.790807 -1.415363
H  -0.23457 -3.599266 2.37171
H  0.159843 1.066982 1.341819
H  1.890475 3.347141 -1.863532
H  -0.299548 3.345387 -3.015501
H  -2.229447 2.195916 -2.03156
H  -3.181109 3.330714 0.545421
H  -4.015574 -0.791853 -0.292679
H  -5.56658 3.866093 0.269834
H  -6.41273 -0.250057 -0.551033
H  -7.196419 2.08477 -0.279793
elementType: Cl O N C H
totalener: -1706.65471638 hartree
nucrepener: 3014.12933869 hartree
electener: -4720.78405507 hartree
oneelecener: -8323.14872570 hartree
twoeener: 3602.36467063 hartree
cpcmener: -0.03138130 hartree
kineticenergy: 1700.53054467 hartree
xcener: -142.757990781711 hartree
chargesum: 0.0000000
charge: -0.099130 -0.273621 -0.410060 -0.319621 -0.086229 0.135034 0.077996 0.030865 -0.322695 -0.312749 0.328135 -0.235799 -0.220906 0.412960 -0.171318 -0.133277 0.062026 0.102817 -0.277920 -0.192512 0.250972 -0.237398 -0.121172 -0.189005 0.273879 -0.184007 -0.225764 -0.149143 -0.142524 -0.171899 0.097200 0.051030 0.096682 0.088196 0.100534 0.104705 0.097674 0.084266 0.149609 0.144820 0.140123 0.144758 0.144021 0.133889 0.145123 0.160454 0.156826 0.156889 0.131011 0.159110 0.157243 0.157899
qa: -0.0991 -0.2736 -0.4101 -0.3196 -0.0862 0.1350 0.0780 0.0309 -0.3227 -0.3127 0.3281 -0.2358 -0.2209 0.4130 -0.1713 -0.1333 0.0620 0.1028 -0.2779 -0.1925 0.2510 -0.2374 -0.1212 -0.1890 0.2739 -0.1840 -0.2258 -0.1491 -0.1425 -0.1719 0.0972 0.0510 0.0967 0.0882 0.1005 0.1047 0.0977 0.0843 0.1496 0.1448 0.1401 0.1448 0.1440 0.1339 0.1451 0.1605 0.1568 0.1569 0.1310 0.1591 0.1572 0.1579
va: 1.2085 2.1360 2.0858 2.0542 3.1121 3.7073 3.8280 3.4640 3.9417 3.9349 4.2691 3.9221 4.0009 3.7414 3.9429 3.9937 3.5370 3.8479 4.0317 3.9659 3.7214 4.0931 3.9140 3.9384 3.6873 3.9249 3.9761 3.8947 3.9261 3.8955 1.0375 1.0200 1.0022 1.0004 1.0048 1.0054 1.0170 0.9973 1.0020 0.9999 1.0145 1.0030 1.0045 1.0277 1.0045 0.9900 0.9971 0.9973 1.0257 0.9900 0.9905 0.9901
dispcorr: -0.032225233 hartree
energy: -1706.686941607913
dipole: 14.08263 -14.01787 0.06477 -6.35332 5.87458 -0.47874 -11.24470 9.87861 -1.36609
magnitude: 1.44900 au
magnitude: 3.68305 debye
