program: Orca
programVersion: 5.0.2
elementType: Cl O O O N C C C C C C C C C C C C C C C C C C C C C C C C C H H H H H H H H H H H H H H H H H H H H H H
charge: 0
multiplicity: 1
keywords: wb97x-d3
keywords: def2-TZVPP
keywords: def2/J RIJCOSX
keywords: DEFGRID2
keywords: scfconv7
keywords: smallprint printgap noloewdin
keywords: NOSOSCF
formula: C25H22ClNO3
InChI: InChI=1/C25H22ClNO3/c1-17(2)24(18-11-13-20(26)14-12-18)25(28)30-23(16-27)19-7-6-10-22(15-19)29-21-8-4-3-5-9-21/h3-15,17,23-24H,1-2H3
52 atoms
Cl -3.096465 -4.287813 -0.846132
O  2.273289 0.88434 0.386554
O  2.412352 -0.199664 -1.568968
O  -2.271285 2.952836 0.806377
N  4.510561 3.232815 1.013257
C  2.063206 -1.462989 0.456998
C  3.280741 -2.405012 0.302175
C  0.754039 -2.125327 0.090693
C  4.570391 -1.694136 0.700507
C  3.085838 -3.659383 1.143908
C  2.265611 -0.22141 -0.377945
C  0.519676 -2.641865 -1.18178
C  -0.231645 -2.276726 1.060089
C  2.487282 2.138375 -0.229266
C  -0.663029 -3.30192 -1.475712
C  -1.418472 -2.939713 0.784489
C  1.258394 3.023311 -0.147235
C  -1.621369 -3.45056 -0.485536
C  0.046779 2.523204 0.303575
C  1.367938 4.347386 -0.559436
C  -1.06315 3.362372 0.32639
C  3.61927 2.750317 0.473624
C  0.257822 5.172923 -0.508893
C  -0.964856 4.685981 -0.072562
C  -2.774688 1.713058 0.524179
C  -3.575497 1.13761 1.501657
C  -2.574401 1.073756 -0.694268
C  -4.189914 -0.080355 1.252545
C  -3.185997 -0.151062 -0.922861
C  -3.997346 -0.731644 0.042428
H  2.008783 -1.165077 1.507234
H  3.354812 -2.700434 -0.749027
H  4.803089 -0.841629 0.059288
H  4.522561 -1.33475 1.731086
H  5.417182 -2.378533 0.631379
H  2.954917 -3.411346 2.200044
H  3.95999 -4.307379 1.063922
H  2.220271 -4.242655 0.828455
H  1.263381 -2.547412 -1.962069
H  -0.072391 -1.883128 2.056629
H  2.778511 2.018409 -1.278426
H  -0.827673 -3.700215 -2.468044
H  -2.169283 -3.052746 1.55468
H  -0.044903 1.498051 0.638595
H  2.313041 4.73909 -0.915919
H  0.340956 6.205921 -0.819769
H  -1.835397 5.328446 -0.03629
H  -3.724486 1.647547 2.445462
H  -1.9608 1.520541 -1.466482
H  -4.818951 -0.522365 2.014575
H  -3.030136 -0.649312 -1.871256
H  -4.47386 -1.684142 -0.146124
elementType: Cl O N C H
totalener: -1706.65637054 hartree
nucrepener: 3000.50839610 hartree
electener: -4707.16476664 hartree
oneelecener: -8295.05394599 hartree
twoeener: 3587.88917935 hartree
cpcmener: -0.03052633 hartree
kineticenergy: 1700.52184572 hartree
xcener: -142.757799757534 hartree
chargesum: 0.0000000
charge: -0.098793 -0.280969 -0.423133 -0.324696 -0.088393 0.133799 0.057112 -0.020481 -0.294167 -0.308912 0.351938 -0.190988 -0.168370 0.398870 -0.164305 -0.155204 0.055909 0.096390 -0.213301 -0.253275 0.284343 -0.215366 -0.105540 -0.248373 0.311786 -0.259627 -0.205149 -0.123389 -0.132919 -0.193548 0.079606 0.058959 0.093229 0.093913 0.094874 0.090620 0.098922 0.098455 0.141306 0.139398 0.141592 0.142629 0.139223 0.149925 0.146020 0.158816 0.146656 0.144774 0.154428 0.156996 0.154968 0.153440
qa: -0.0988 -0.2810 -0.4231 -0.3247 -0.0884 0.1338 0.0571 -0.0205 -0.2942 -0.3089 0.3519 -0.1910 -0.1684 0.3989 -0.1643 -0.1552 0.0559 0.0964 -0.2133 -0.2533 0.2843 -0.2154 -0.1055 -0.2484 0.3118 -0.2596 -0.2051 -0.1234 -0.1329 -0.1935 0.0796 0.0590 0.0932 0.0939 0.0949 0.0906 0.0989 0.0985 0.1413 0.1394 0.1416 0.1426 0.1392 0.1499 0.1460 0.1588 0.1467 0.1448 0.1544 0.1570 0.1550 0.1534
va: 1.2069 2.1153 2.0845 2.0882 3.1066 3.7016 3.8208 3.5494 3.9379 3.9418 4.1747 4.0143 3.9408 3.7062 4.0205 3.9275 3.6668 3.7804 3.9612 4.0127 3.7487 4.0277 3.8966 4.0256 3.6699 4.0140 3.9091 3.8917 3.8299 3.8426 1.0468 1.0223 1.0099 1.0022 1.0046 1.0020 1.0054 1.0002 1.0231 1.0044 1.0302 1.0071 1.0094 1.0092 1.0055 0.9895 1.0063 1.0088 0.9983 0.9903 0.9944 1.0049
dispcorr: -0.031737429 hartree
energy: -1706.688107968994
dipole: 16.53650 -16.97796 -0.44146 -4.80766 4.19234 -0.61532 5.33865 -5.45280 -0.11414
magnitude: 0.76586 au
magnitude: 1.94666 debye
