program: Orca
programVersion: 5.0.2
elementType: Cl O O O N C C C C C C C C C C C C C C C C C C C C C C C C C H H H H H H H H H H H H H H H H H H H H H H
charge: 0
multiplicity: 1
keywords: wb97x-d3
keywords: def2-TZVPP
keywords: def2/J RIJCOSX
keywords: DEFGRID2
keywords: scfconv7
keywords: smallprint printgap noloewdin
keywords: NOSOSCF
formula: C25H22ClNO3
InChI: InChI=1/C25H22ClNO3/c1-17(2)24(18-11-13-20(26)14-12-18)25(28)30-23(16-27)19-7-6-10-22(15-19)29-21-8-4-3-5-9-21/h3-15,17,23-24H,1-2H3
52 atoms
Cl -2.723843 -3.974645 1.079212
O  2.016924 0.44706 0.099523
O  3.627938 0.067554 1.5917
O  -2.406887 2.974023 -1.403505
N  1.270102 2.318548 2.838696
C  2.82469 -1.765477 0.23432
C  3.373869 -1.866344 -1.20717
C  1.4248 -2.315106 0.412529
C  4.736777 -1.193804 -1.330427
C  3.465964 -3.329616 -1.619704
C  2.89006 -0.342334 0.735931
C  0.404312 -2.076005 -0.50539
C  1.132158 -3.074137 1.540574
C  2.04808 1.840993 0.386412
C  -0.868796 -2.586667 -0.308993
C  -0.138858 -3.586898 1.757976
C  1.145366 2.507299 -0.617993
C  -1.131382 -3.336637 0.82675
C  -0.236593 2.428383 -0.477974
C  1.715232 3.129104 -1.717815
C  -1.049026 2.972935 -1.462412
C  1.616054 2.08941 1.767866
C  0.889143 3.677881 -2.689885
C  -0.486329 3.59873 -2.571498
C  -3.080913 2.130496 -0.557075
C  -2.911144 0.753188 -0.616773
C  -3.993237 2.698432 0.317841
C  -3.663898 -0.055271 0.222083
C  -4.750204 1.876355 1.141424
C  -4.584123 0.499555 1.101715
H  3.49752 -2.334186 0.882187
H  2.685087 -1.357023 -1.887059
H  5.453685 -1.607922 -0.617871
H  5.142364 -1.347128 -2.331769
H  4.692908 -0.114233 -1.172741
H  2.503729 -3.839514 -1.563753
H  4.168489 -3.873167 -0.983441
H  3.819473 -3.414339 -2.648783
H  0.58669 -1.494143 -1.39925
H  1.908001 -3.276844 2.269023
H  3.066254 2.229497 0.288421
H  -1.643982 -2.40111 -1.040516
H  -0.343631 -4.175311 2.642237
H  -0.668112 1.951383 0.39376
H  2.79171 3.183393 -1.818916
H  1.321614 4.167019 -3.552569
H  -1.129589 4.025128 -3.331289
H  -2.203449 0.313107 -1.308579
H  -4.115829 3.773773 0.347546
H  -3.534506 -1.128966 0.1839
H  -5.467133 2.318802 1.820485
H  -5.170083 -0.139496 1.749047
elementType: Cl O N C H
totalener: -1706.65693150 hartree
nucrepener: 2988.53332596 hartree
electener: -4695.19025746 hartree
oneelecener: -8271.31184765 hartree
twoeener: 3576.12159020 hartree
cpcmener: -0.03543437 hartree
kineticenergy: 1700.53904070 hartree
xcener: -142.757309052773 hartree
chargesum: 0.0000000
charge: -0.098404 -0.255255 -0.412372 -0.321239 -0.083834 0.166567 0.029499 -0.001790 -0.297733 -0.295514 0.321802 -0.225459 -0.179202 0.394824 -0.180522 -0.146094 0.001578 0.105666 -0.227220 -0.208278 0.291376 -0.236328 -0.108899 -0.240759 0.285282 -0.218116 -0.236726 -0.091306 -0.114579 -0.202594 0.090211 0.059930 0.097040 0.094000 0.092035 0.099379 0.090888 0.096719 0.142533 0.139987 0.132327 0.154808 0.142692 0.144291 0.145188 0.158499 0.147827 0.155956 0.145318 0.143043 0.157849 0.155112
qa: -0.0984 -0.2553 -0.4124 -0.3212 -0.0838 0.1666 0.0295 -0.0018 -0.2977 -0.2955 0.3218 -0.2255 -0.1792 0.3948 -0.1805 -0.1461 0.0016 0.1057 -0.2272 -0.2083 0.2914 -0.2363 -0.1089 -0.2408 0.2853 -0.2181 -0.2367 -0.0913 -0.1146 -0.2026 0.0902 0.0599 0.0970 0.0940 0.0920 0.0994 0.0909 0.0967 0.1425 0.1400 0.1323 0.1548 0.1427 0.1443 0.1452 0.1585 0.1478 0.1560 0.1453 0.1430 0.1578 0.1551
va: 1.2087 2.1507 2.0888 2.0947 3.1111 3.6476 3.8345 3.5464 3.9462 3.9317 4.2160 3.9710 4.0169 3.7553 3.9644 3.9946 3.7457 3.8295 3.9570 3.9587 3.7677 4.0319 3.9022 4.0044 3.7207 3.9533 4.0214 3.8330 3.8771 3.9570 1.0334 1.0216 1.0044 1.0037 1.0073 1.0019 1.0017 1.0051 1.0119 1.0041 1.0129 0.9942 1.0058 1.0106 1.0020 0.9892 1.0068 0.9966 1.0071 1.0065 0.9888 0.9929
dispcorr: -0.030242248 hartree
energy: -1706.687173745251
dipole: 20.00799 -19.25449 0.75350 -2.37968 1.87239 -0.50729 -14.00087 11.43539 -2.56548
magnitude: 2.72154 au
magnitude: 6.91762 debye
