program: Orca
programVersion: 5.0.2
elementType: Cl O O O N C C C C C C C C C C C C C C C C C C C C C C C C C H H H H H H H H H H H H H H H H H H H H H H
charge: 0
multiplicity: 1
keywords: wb97x-d3
keywords: def2-TZVPP
keywords: def2/J RIJCOSX
keywords: DEFGRID2
keywords: scfconv7
keywords: smallprint printgap noloewdin
keywords: NOSOSCF
formula: C25H22ClNO3
InChI: InChI=1/C25H22ClNO3/c1-17(2)24(18-11-13-20(26)14-12-18)25(28)30-23(16-27)19-7-6-10-22(15-19)29-21-8-4-3-5-9-21/h3-15,17,23-24H,1-2H3
52 atoms
Cl 4.988661 -4.712501 2.448388
O  0.68441 0.227825 0.414134
O  1.658639 0.111401 -1.589179
O  -2.913261 3.886045 -0.86531
N  0.822493 2.08814 3.11778
C  0.666471 -1.880711 -0.660418
C  -0.763517 -2.154142 -0.162228
C  1.74281 -2.588905 0.139116
C  -1.782734 -1.417719 -1.023913
C  -1.044486 -3.65197 -0.174699
C  1.04471 -0.417045 -0.702594
C  1.829937 -2.462307 1.524129
C  2.679869 -3.381494 -0.51485
C  1.167253 1.555625 0.582757
C  2.824176 -3.112379 2.237519
C  3.681046 -4.040056 0.184116
C  0.448502 2.579186 -0.263568
C  3.744206 -3.897548 1.559722
C  -0.934542 2.69703 -0.191126
C  1.188404 3.420705 -1.082242
C  -1.568125 3.671625 -0.949879
C  0.972503 1.839955 2.006671
C  0.540806 4.394446 -1.827536
C  -0.837571 4.519707 -1.771506
C  -3.784858 2.833798 -0.939111
C  -3.598714 1.779771 -1.824636
C  -4.911728 2.891477 -0.130778
C  -4.555293 0.775941 -1.890569
C  -5.8629 1.885371 -0.214453
C  -5.687544 0.82122 -1.088803
H  0.733845 -2.230086 -1.694719
H  -0.860429 -1.79958 0.867842
H  -1.640242 -0.335613 -1.015151
H  -1.735169 -1.749637 -2.063887
H  -2.794387 -1.607583 -0.662494
H  -0.935447 -4.067815 -1.179454
H  -2.06587 -3.849082 0.154612
H  -0.378415 -4.20538 0.488039
H  1.116902 -1.859588 2.071858
H  2.6311 -3.494906 -1.591019
H  2.243319 1.601197 0.385335
H  2.876852 -3.004783 3.312651
H  4.397345 -4.656093 -0.342911
H  -1.510682 2.053649 0.464968
H  2.265141 3.321119 -1.132166
H  1.112269 5.054192 -2.466959
H  -1.348221 5.275581 -2.354737
H  -2.727515 1.739248 -2.466773
H  -5.043111 3.721376 0.552453
H  -4.411583 -0.045112 -2.581409
H  -6.742124 1.93343 0.415012
H  -6.429008 0.035306 -1.147718
elementType: Cl O N C H
totalener: -1706.65619605 hartree
nucrepener: 2908.69446557 hartree
electener: -4615.35066162 hartree
oneelecener: -8111.47551073 hartree
twoeener: 3496.12484911 hartree
cpcmener: -0.03289871 hartree
kineticenergy: 1700.53893931 hartree
xcener: -142.757107476929 hartree
chargesum: -0.0000000
charge: -0.097333 -0.272608 -0.416082 -0.330587 -0.085812 0.176154 0.055022 -0.041221 -0.293206 -0.300911 0.334165 -0.204653 -0.185134 0.384477 -0.158768 -0.156655 0.046635 0.106224 -0.203469 -0.188007 0.213392 -0.230872 -0.120530 -0.215138 0.286648 -0.193312 -0.246985 -0.177337 -0.121626 -0.170870 0.098084 0.053844 0.065909 0.098493 0.097125 0.090339 0.098072 0.098606 0.142872 0.139814 0.142910 0.142669 0.142859 0.157973 0.143995 0.158566 0.149624 0.160118 0.146180 0.164839 0.157569 0.157939
qa: -0.0973 -0.2726 -0.4161 -0.3306 -0.0858 0.1762 0.0550 -0.0412 -0.2932 -0.3009 0.3342 -0.2047 -0.1851 0.3845 -0.1588 -0.1567 0.0466 0.1062 -0.2035 -0.1880 0.2134 -0.2309 -0.1205 -0.2151 0.2866 -0.1933 -0.2470 -0.1773 -0.1216 -0.1709 0.0981 0.0538 0.0659 0.0985 0.0971 0.0903 0.0981 0.0986 0.1429 0.1398 0.1429 0.1427 0.1429 0.1580 0.1440 0.1586 0.1496 0.1601 0.1462 0.1648 0.1576 0.1579
va: 1.2072 2.1211 2.1014 2.0781 3.1079 3.6209 3.8598 3.5620 3.9665 3.9296 4.2360 3.9899 4.0250 3.7563 4.0253 3.9968 3.5708 3.8258 3.9292 3.9648 3.7979 4.0771 3.9049 4.0114 3.6845 3.8536 4.0090 3.8704 3.8946 3.8916 1.0301 1.0230 1.0017 1.0024 1.0026 1.0026 1.0050 1.0016 1.0124 1.0049 1.0134 1.0070 1.0064 1.0049 1.0050 0.9895 1.0037 0.9961 1.0078 0.9866 0.9887 0.9901
dispcorr: -0.030006770 hartree
energy: -1706.686202819523
dipole: -26.82008 25.94182 -0.87826 -1.33747 0.76287 -0.57460 -14.52279 12.93197 -1.59082
magnitude: 1.90583 au
magnitude: 4.84424 debye
