program: Orca
programVersion: 5.0.2
elementType: Cl O O O N C C C C C C C C C C C C C C C C C C C C C C C C C H H H H H H H H H H H H H H H H H H H H H H
charge: 0
multiplicity: 1
keywords: wb97x-d3
keywords: def2-TZVPP
keywords: def2/J RIJCOSX
keywords: DEFGRID2
keywords: scfconv7
keywords: smallprint printgap noloewdin
keywords: NOSOSCF
formula: C25H22ClNO3
InChI: InChI=1/C25H22ClNO3/c1-17(2)24(18-11-13-20(26)14-12-18)25(28)30-23(16-27)19-7-6-10-22(15-19)29-21-8-4-3-5-9-21/h3-15,17,23-24H,1-2H3
52 atoms
Cl 3.006809 -6.410963 -2.26064
O  0.8865 0.788271 -0.182355
O  2.693129 -0.270537 0.579184
O  -2.910151 4.060712 -0.030376
N  2.38525 2.722072 2.207095
C  0.623305 -1.498096 0.283963
C  0.184284 -1.769645 1.747645
C  1.268579 -2.699782 -0.361755
C  -0.411881 -0.528673 2.405232
C  -0.82314 -2.911774 1.774039
C  1.539491 -0.298381 0.244587
C  2.401417 -3.309465 0.172823
C  0.693609 -3.255399 -1.499285
C  1.556953 2.040357 -0.179857
C  2.943249 -4.443757 -0.410592
C  1.220347 -4.392806 -2.093985
C  0.558829 3.066907 -0.654649
C  2.343773 -4.980796 -1.539151
C  -0.702205 3.091466 -0.069431
C  0.891024 3.952539 -1.666262
C  -1.650689 3.985119 -0.540575
C  2.025242 2.385969 1.169149
C  -0.058745 4.869484 -2.100551
C  -1.330008 4.882811 -1.554581
C  -3.47182 2.973257 0.59011
C  -4.067874 3.177811 1.824778
C  -3.498603 1.721952 -0.014642
C  -4.69913 2.117176 2.460658
C  -4.118246 0.667669 0.63955
C  -4.720405 0.858865 1.876847
H  -0.279131 -1.24959 -0.281396
H  1.069818 -2.069349 2.316728
H  -1.251316 -0.133863 1.827742
H  -0.789585 -0.778903 3.397663
H  0.315091 0.273632 2.544183
H  -1.715009 -2.661678 1.1939
H  -1.141531 -3.113018 2.797948
H  -0.413053 -3.839006 1.372964
H  2.87307 -2.915359 1.063013
H  -0.189412 -2.800388 -1.931653
H  2.429868 2.018767 -0.839573
H  3.821394 -4.906464 0.019654
H  0.75241 -4.811915 -2.974701
H  -0.940442 2.41234 0.739987
H  1.87437 3.926555 -2.117903
H  0.188484 5.567976 -2.888859
H  -2.075836 5.583029 -1.909419
H  -4.042045 4.15903 2.281873
H  -3.043863 1.565756 -0.985173
H  -5.167945 2.278041 3.422868
H  -4.13464 -0.30857 0.172176
H  -5.205374 0.032466 2.379458
elementType: Cl O N C H
totalener: -1706.65699616 hartree
nucrepener: 2893.34572944 hartree
electener: -4600.00272560 hartree
oneelecener: -8080.78052001 hartree
twoeener: 3480.77779441 hartree
cpcmener: -0.03467156 hartree
kineticenergy: 1700.53850942 hartree
xcener: -142.757798431098 hartree
chargesum: 0.0000000
charge: -0.099101 -0.267649 -0.418361 -0.324357 -0.083256 0.119817 0.058297 -0.016879 -0.285103 -0.304465 0.357100 -0.199634 -0.160194 0.402166 -0.173224 -0.161336 0.007083 0.109286 -0.212338 -0.206300 0.267515 -0.238505 -0.105008 -0.240863 0.278399 -0.236939 -0.186035 -0.121251 -0.159143 -0.170307 0.078973 0.066009 0.063215 0.100379 0.094310 0.088693 0.098737 0.099627 0.139064 0.138976 0.135043 0.140775 0.141051 0.156908 0.146610 0.158305 0.147134 0.146458 0.156051 0.158424 0.158443 0.157401
qa: -0.0991 -0.2676 -0.4184 -0.3244 -0.0833 0.1198 0.0583 -0.0169 -0.2851 -0.3045 0.3571 -0.1996 -0.1602 0.4022 -0.1732 -0.1613 0.0071 0.1093 -0.2123 -0.2063 0.2675 -0.2385 -0.1050 -0.2409 0.2784 -0.2369 -0.1860 -0.1213 -0.1591 -0.1703 0.0790 0.0660 0.0632 0.1004 0.0943 0.0887 0.0987 0.0996 0.1391 0.1390 0.1350 0.1408 0.1411 0.1569 0.1466 0.1583 0.1471 0.1465 0.1561 0.1584 0.1584 0.1574
va: 1.2052 2.1689 2.0802 2.0913 3.1027 3.7165 3.8058 3.5337 3.9558 3.9356 4.2115 4.0177 3.9688 3.7810 4.0306 4.0039 3.7243 3.8177 3.9371 3.9619 3.7866 4.0189 3.8979 4.0078 3.6869 4.0143 3.8986 3.8827 3.8492 3.8865 1.0480 1.0193 1.0076 1.0098 1.0090 1.0012 1.0059 1.0016 1.0216 1.0043 1.0122 1.0073 1.0069 1.0032 1.0024 0.9893 1.0064 1.0071 0.9964 0.9888 0.9921 0.9904
dispcorr: -0.029250584 hartree
energy: -1706.686246745198
dipole: -19.91939 17.92297 -1.99642 7.07964 -7.04574 0.03390 14.00969 -15.24701 -1.23732
magnitude: 2.34900 au
magnitude: 5.97069 debye
