program: Gaussian 09
title: 000074691
version: EM64L-G09RevD.01
frameworkgroup: C1[X(C14H11N)]
method: RPBEPBE
basis: SDD
operation: Freq
keyword: #pfreq=noraman
keyword: PBEPBE/SDD
title: #p freq=noraman PBEPBE/SDD
converged: NO YES NO YES
title: Mulliken charges:
elementType: N C C C C C C C C C C C C C C H H H H H H H H H H H
charge: -0.703560 0.263859 0.185608 0.442986 0.424684 -0.598557 -0.486568 -0.489768 -0.367121 -0.436180 0.529107 -0.436698 -0.464972 -0.263963 -0.249454 0.213048 0.235118 0.231938 0.217840 0.235010 0.237122 0.218441 0.223951 0.225910 0.305707 0.306514
chargesum: 0.00000
title: Mulliken charges with hydrogens summed into heavy atoms:
elementType: N C C C C C C C C C C C C C C
charge: -0.091339 0.263859 0.185608 0.442986 0.424684 -0.385509 -0.251450 -0.257830 -0.149281 -0.201170 0.529107 -0.199576 -0.246531 -0.040012 -0.023544
polarizability: 2.71686748e+02 -7.08201882e-01 1.80233553e+02 -3.16073379e-03 -3.51708715e-03 6.11808125e+01
1716.lowfreq: -7.8410 -0.0007 -0.0004 0.0005 6.1624 15.0196 79.8427 104.2276 176.8891
frequency: 79.8338 104.2099 176.8884 194.9365 243.0291 299.2202 347.7807 354.1515 381.0845 392.0577 424.3176 430.8928 452.6523 470.1132 514.4781 524.6798 567.6842 623.9697 629.3270 693.1137 708.9851 724.7725 753.8827 771.7881 793.7415 808.0933 844.3185 867.3031 873.1719 886.9511 896.3565 948.5602 956.2738 976.8845 987.6062 1003.7743 1038.7563 1049.8408 1098.5718 1151.7680 1164.5481 1176.1333 1228.7134 1232.9123 1251.0570 1267.7404 1289.1159 1334.8241 1394.2516 1401.8767 1413.8147 1444.7795 1449.0764 1462.0947 1518.0845 1532.8085 1572.5785 1613.3888 1623.4847 1638.1086 1646.1388 3113.1046 3115.1840 3117.6043 3127.1904 3132.9322 3138.7257 3141.2625 3146.4252 3161.9994 3567.3877 3708.0086
redmass: 3.9561 4.1763 3.8682 4.3951 4.1250 3.6259 3.7604 1.1730 1.1073 6.3971 3.0494 2.9005 5.5655 3.6948 2.8644 6.6165 3.0691 6.9923 3.1944 5.5791 6.0324 2.3709 1.3466 5.6938 1.7214 1.5501 1.6416 4.2041 1.7404 2.1985 5.0908 1.3366 1.4027 1.3985 1.3646 2.5898 2.1242 1.7318 1.9533 1.2927 1.2118 1.0871 2.0450 1.7815 1.9777 1.5594 1.8659 2.4295 5.7666 3.1926 2.3491 3.4139 3.5323 3.1592 3.8981 3.8745 7.6488 5.8042 6.4712 1.7870 2.2374 1.0863 1.0861 1.0860 1.0888 1.0900 1.0981 1.0973 1.0928 1.0999 1.0449 1.1040
irintensity: 1.4503 1.5855 6.3085 1.6466 0.3142 1.0623 2.3836 226.3940 82.9242 0.4682 11.5970 2.6384 3.5833 0.6039 2.5068 0.1793 5.6606 5.5580 9.4377 3.9317 0.2706 0.9216 55.6792 1.7397 2.5489 0.7394 124.7404 3.4419 4.3370 18.9084 5.6698 0.4794 5.7955 0.0340 0.1713 1.4644 7.5176 0.3408 5.0569 15.0966 13.7839 0.4489 1.8029 5.1555 26.7538 28.1515 15.3234 29.1031 1.6385 9.2161 2.5878 10.8883 19.6794 36.7472 13.9386 69.3206 3.0324 7.8212 31.6377 4.4431 417.2992 2.2274 10.0018 2.3099 14.0493 5.7046 21.1222 41.8876 48.3051 36.8038 94.9750 20.0558
temp: 298.150 k
press: 1.00000 atm
elementType: 7 6 6 6 6 6 6 6 6 6 6 6 6 6 6 1 1 1 1 1 1 1 1 1 1 1
symmnumber: 1
zpe: 545324.7 jmol-1
zpe.correction: 0.207703 hartree
zpe.thermalcorrener: 0.218905 hartree
zpe.thermalcorrenthalpy: 0.219849 hartree
zpe.thermalcorrgfe: 0.171148 hartree
zpe.sumelectzpe: -593.860816 hartree
zpe.sumelectthermal: -593.849614 hartree
zpe.sumelectthermalent: -593.848670 hartree
zpe.sumelectthermalfe: -593.897371 hartree
dipole: -2.4226 -1.4882 0.0018
dipole: 2.8431
quadrupole: -64.8972 -71.7950 -96.0677
quadrupole: 5.6646 -0.0084 -0.0050
quadrupole: 12.6894 5.7916 -18.4810 5.6646 -0.0084 -0.0050
hfenergy: -594.0685193 hartree
pointgroup: C01 [X(C14H11N1)]
dipole: 0.933293 -0.6165931 -0.0006936 debye
dipolederiv: -1.0546447 0.6658202 -0.0001757 1.0891133 -0.8373537 0.0001789 -0.0008346 0.0005598 -0.7445906 0.3391616 -0.2288212 -0.0000059 -0.2621313 0.224368 -0.0000036 -0.0000308 0.0000008 0.0276551 0.0849635 0.1862482 0.0000043 -0.0264021 -0.0481984 -0.0000008 0.0000007 -0.000007 -0.0144009 -0.3049894 -0.0882651 -0.0000165 0.1359095 -0.2908899 -0.0000043 0.0000075 -0.0000019 0.0133121 0.0082276 0.1305307 0.0000088 0.3402496 0.089666 -0.0000018 0.0000145 -0.0000002 0.0618668 -0.6650413 0.4680801 -0.0000019 0.0637757 -0.0683901 0.0000159 0.0000431 -0.0000361 -0.2483857 0.3296355 -0.0179229 0.0000009 -0.2757451 0.1701179 0.0000123 -0.0000141 0.0000126 -0.1693576 -0.3126615 -0.0754806 -0.0000071 -0.0707722 0.0130698 0.0000109 -0.0000069 0.0000139 -0.2116397 -0.0521657 -0.0972388 -0.0000018 0.0099635 0.0128926 0.0000022 0.0000048 0.0000022 -0.1439957 0.4044195 0.0578434 0.0000071 -0.082236 0.1587172 0.0000061 -0.0000077 0.0000152 -0.1438444 1.061216 -0.810746 0.0000822 -1.1335005 0.8084418 -0.0000833 0.0001461 -0.0000552 0.1485567 0.0118122 -0.1294798 -0.0000078 -0.1841814 0.027618 0.000009 -0.0000102 0.0000105 -0.1811585 -0.0576252 -0.0117235 0.0000067 0.5783236 -0.2534185 -0.0000056 0.0000596 -0.0000057 -0.2266502 -0.1210422 0.0715793 0.0000026 -0.0170097 0.0826393 0.000006 -0.0000034 0.0000056 -0.1766662 0.09018 -0.0131233 -0.0000042 -0.0141441 -0.0138128 0.0000045 -0.0000078 0.0000035 -0.1657419 0.0750026 -0.0553306 -0.0000046 -0.0085974 -0.1153009 -0.0000164 0.0000011 -0.0000058 0.1576585 0.0456785 -0.1124605 -0.0000028 -0.0350759 -0.103271 -0.0000092 0.0000008 -0.0000073 0.1524934 -0.0255305 0.1354983 0.0000082 0.0593222 -0.0379443 -0.0000082 0.0000073 -0.000012 0.1594656 0.0282773 0.1286378 0.0000048 0.069914 -0.0372227 -0.0000057 0.000003 -0.0000057 0.1411499 0.0641474 -0.0277254 0.0000005 -0.0981843 -0.1052327 -0.0000099 0.0000014 -0.0000126 0.14818 0.0035732 0.062977 0.0000043 0.1392265 -0.0554752 -0.0000089 0.0000059 -0.0000083 0.1546946 -0.1720034 -0.0295454 0.0000056 0.0025992 0.0776567 0.0000007 -0.0000049 -0.0000036 0.1673517 0.0389156 -0.0705599 0. -0.1046868 -0.1123788 -0.0000053 -0.0000016 -0.0000066 0.1610636 -0.161107 -0.0391956 0.0000043 -0.0411728 0.0865309 -0.000001 0.0000072 -0.0000009 0.1618235 0.1256529 -0.0455009 -0.0000051 -0.0933005 0.1786014 -0.0000855 0.0002036 -0.0002983 0.384782 0.2159473 -0.0540955 0.0000933 -0.0412569 0.1485695 0.0000027 0.0004155 -0.0001568 0.3863777 unknown
polarizability: 271.6340829|-2.305461|180.2862175|-0.0030431|0.0036193|61.1808125 unknown
InChI: InChI=1S/C14H11N/c15-12-8-7-11-6-5-10-3-1-2-4-13(10)14(11)9-12/h1-9H,15H2
charge 0 multiplicity 1
26 atoms
N  3.796091 -1.957086 -0.000057
C  0.520114 -0.120262 -0.000063
C  -0.928378 -0.364567 -0.000044
C  0.992123 1.245042 -0.000024
C  -1.834571 0.76107 0.000007
C  1.47763 -1.173146 -0.000133
C  0.050737 2.338325 0.000033
C  -1.312368 2.109439 0.00004
C  -1.491823 -1.677534 -0.000071
C  2.400161 1.489007 -0.000039
C  2.867382 -0.914755 -0.000142
C  -3.245727 0.529784 0.000019
C  3.324684 0.445536 -0.000084
C  -2.878932 -1.882192 -0.000051
C  -3.767548 -0.768908 -0.000012
H  1.144772 -2.216985 -0.00016
H  0.443266 3.362624 0.000067
H  -2.021744 2.945336 0.000083
H  -0.83465 -2.553192 -0.0001
H  2.752717 2.527635 -0.000006
H  -3.918533 1.39616 0.000057
H  4.401387 0.654896 -0.000064
H  -3.280451 -2.901689 -0.000069
H  -4.851108 -0.931038 0.000003
H  3.493187 -2.926478 -0.000522
H  4.793084 -1.764823 -0.000566
