program: Orca
programVersion: 5.0.2
elementType: Cl O O O N C C C C C C C C C C C C C C C C C C C C C C C C C H H H H H H H H H H H H H H H H H H H H H H
charge: 0
multiplicity: 1
keywords: wb97x-d3
keywords: def2-TZVPP
keywords: def2/J RIJCOSX
keywords: DEFGRID2
keywords: scfconv7
keywords: smallprint printgap noloewdin
keywords: NOSOSCF
formula: C25H22ClNO3
InChI: InChI=1/C25H22ClNO3/c1-17(2)24(18-11-13-20(26)14-12-18)25(28)30-23(16-27)19-7-6-10-22(15-19)29-21-8-4-3-5-9-21/h3-15,17,23-24H,1-2H3
52 atoms
Cl -1.073402 -2.252201 4.000031
O  2.601293 0.831134 -0.574897
O  1.183961 0.074305 -2.130948
O  -2.926061 2.012211 0.14372
N  3.675828 3.812036 0.361478
C  2.468016 -1.50181 -0.817363
C  2.393424 -2.580794 -1.905014
C  1.586456 -1.762009 0.390431
C  3.361196 -2.263093 -3.039853
C  2.708408 -3.948954 -1.311956
C  2.019445 -0.140569 -1.29506
C  2.12674 -1.784204 1.670457
C  0.209912 -1.917478 0.244456
C  1.930347 2.091953 -0.538652
C  1.319242 -1.950359 2.786817
C  -0.611274 -2.08056 1.347858
C  0.724208 1.984346 0.362088
C  -0.04757 -2.088474 2.614405
C  -0.543729 2.11341 -0.181965
C  0.889537 1.649689 1.703455
C  -1.654454 1.880693 0.62143
C  2.917165 3.043418 -0.028027
C  -0.226863 1.442473 2.49464
C  -1.502537 1.542557 1.956343
C  -3.26282 1.477711 -1.069354
C  -4.248502 2.138754 -1.789402
C  -2.699599 0.302918 -1.553659
C  -4.67158 1.618789 -3.003672
C  -3.12491 -0.197883 -2.775909
C  -4.108674 0.453717 -3.506793
H  3.503459 -1.426867 -0.471388
H  1.376886 -2.606575 -2.308891
H  3.152943 -1.304212 -3.516611
H  4.392444 -2.238268 -2.67946
H  3.305231 -3.026321 -3.81756
H  2.68984 -4.714757 -2.088981
H  1.989384 -4.245769 -0.547599
H  3.702454 -3.965244 -0.858141
H  3.194226 -1.662649 1.807289
H  -0.242191 -1.908506 -0.739812
H  1.642454 2.425046 -1.540237
H  1.755586 -1.957656 3.776647
H  -1.679686 -2.189581 1.217749
H  -0.661402 2.380062 -1.225345
H  1.879603 1.543987 2.12999
H  -0.107838 1.179347 3.537158
H  -2.375476 1.360019 2.570169
H  -4.681646 3.050939 -1.398164
H  -1.940789 -0.225418 -0.990601
H  -5.441262 2.135594 -3.562243
H  -2.682224 -1.110932 -3.153038
H  -4.435286 0.05553 -4.458322
elementType: Cl O N C H
totalener: -1706.65593425 hartree
nucrepener: 3070.06715434 hartree
electener: -4776.72308859 hartree
oneelecener: -8434.31590327 hartree
twoeener: 3657.59281468 hartree
cpcmener: -0.03175996 hartree
kineticenergy: 1700.54967207 hartree
xcener: -142.762429175736 hartree
chargesum: 0.0000000
charge: -0.097170 -0.273359 -0.416555 -0.328376 -0.084876 0.132800 0.061422 0.004036 -0.294408 -0.308523 0.314701 -0.181029 -0.220087 0.399415 -0.147520 -0.170634 0.078671 0.122070 -0.210578 -0.276927 0.299705 -0.230656 -0.089159 -0.245553 0.261226 -0.224910 -0.134597 -0.136897 -0.189754 -0.164540 0.097509 0.045756 0.096154 0.089111 0.093744 0.097575 0.097921 0.090202 0.136633 0.152795 0.136313 0.139657 0.139711 0.146133 0.145377 0.154095 0.144913 0.144633 0.133913 0.157244 0.155719 0.156956
qa: -0.0972 -0.2734 -0.4166 -0.3284 -0.0849 0.1328 0.0614 0.0040 -0.2944 -0.3085 0.3147 -0.1810 -0.2201 0.3994 -0.1475 -0.1706 0.0787 0.1221 -0.2106 -0.2769 0.2997 -0.2307 -0.0892 -0.2456 0.2612 -0.2249 -0.1346 -0.1369 -0.1898 -0.1645 0.0975 0.0458 0.0962 0.0891 0.0937 0.0976 0.0979 0.0902 0.1366 0.1528 0.1363 0.1397 0.1397 0.1461 0.1454 0.1541 0.1449 0.1446 0.1339 0.1572 0.1557 0.1570
va: 1.2075 2.1520 2.0766 2.0868 3.1124 3.6643 3.8134 3.4406 3.9288 3.9474 4.2864 3.9716 3.9516 3.7530 3.9677 3.9715 3.5194 3.7744 3.9639 3.9706 3.7008 4.0802 3.8337 3.9941 3.7196 3.9757 3.8462 3.9022 3.9417 3.8872 1.0383 1.0272 1.0121 1.0021 1.0043 1.0048 1.0007 1.0022 1.0051 1.0010 1.0180 1.0073 1.0096 1.0092 1.0109 0.9933 1.0080 1.0087 0.9935 0.9893 0.9932 0.9904
dispcorr: -0.034385782 hartree
energy: -1706.690320031126
dipole: 8.78916 -8.93489 -0.14573 -14.03608 12.40637 -1.62972 -22.95171 22.29077 -0.66094
magnitude: 1.76467 au
magnitude: 4.48543 debye
