program: Orca
programVersion: 5.0.2
elementType: Cl O O O N C C C C C C C C C C C C C C C C C C C C C C C C C H H H H H H H H H H H H H H H H H H H H H H
charge: 0
multiplicity: 1
keywords: wb97x-d3
keywords: def2-TZVPP
keywords: def2/J RIJCOSX
keywords: DEFGRID2
keywords: scfconv7
keywords: smallprint printgap noloewdin
keywords: NOSOSCF
formula: C25H22ClNO3
InChI: InChI=1/C25H22ClNO3/c1-17(2)24(18-11-13-20(26)14-12-18)25(28)30-23(16-27)19-7-6-10-22(15-19)29-21-8-4-3-5-9-21/h3-15,17,23-24H,1-2H3
52 atoms
Cl 2.777708 -5.271226 3.850221
O  0.968768 0.245723 0.403584
O  2.766886 0.421294 -0.906036
O  -2.289073 3.171916 -2.368451
N  -0.308319 1.862971 2.979641
C  1.56707 -1.6740 -0.835773
C  0.155511 -1.857726 -1.432634
C  1.852422 -2.557978 0.360473
C  -0.039412 -0.950967 -2.643428
C  -0.057634 -3.314364 -1.824945
C  1.853924 -0.232997 -0.480514
C  1.001742 -2.61713 1.46244
C  2.993835 -3.353065 0.363491
C  1.118515 1.60176 0.806714
C  1.282096 -3.446726 2.536314
C  3.290195 -4.189131 1.430131
C  0.636495 2.566383 -0.250068
C  2.42696 -4.228368 2.511405
C  -0.640135 2.41017 -0.779278
C  1.472939 3.577658 -0.695492
C  -1.076412 3.288591 -1.760284
C  0.31456 1.727418 2.024544
C  1.021517 4.448201 -1.677915
C  -0.248502 4.311105 -2.210657
C  -3.370957 2.684608 -1.682525
C  -4.167038 1.751106 -2.329278
C  -3.705078 3.150907 -0.41694
C  -5.314745 1.28452 -1.703271
C  -4.847845 2.665836 0.201568
C  -5.657224 1.734517 -0.436069
H  2.28911 -1.928289 -1.616567
H  -0.589852 -1.591573 -0.677446
H  -1.031342 -1.097826 -3.073342
H  0.043551 0.110137 -2.399189
H  0.694099 -1.170491 -3.422725
H  0.687283 -3.639042 -2.555435
H  -1.041774 -3.445986 -2.277217
H  -0.000839 -3.988929 -0.97012
H  0.096971 -2.024528 1.497781
H  3.668274 -3.32818 -0.483824
H  2.157007 1.820952 1.075871
H  0.609127 -3.482243 3.382574
H  4.181814 -4.801395 1.409015
H  -1.280988 1.607671 -0.43159
H  2.467668 3.685476 -0.282645
H  1.665557 5.241658 -2.033104
H  -0.601331 4.989221 -2.977501
H  -3.894778 1.400358 -3.316992
H  -3.08768 3.886962 0.083168
H  -5.939138 0.560417 -2.210613
H  -5.109025 3.027271 1.187815
H  -6.550088 1.365363 0.051068
elementType: Cl O N C H
totalener: -1706.65726016 hartree
nucrepener: 2907.66536346 hartree
electener: -4614.32262362 hartree
oneelecener: -8109.60810143 hartree
twoeener: 3495.28547782 hartree
cpcmener: -0.03225095 hartree
kineticenergy: 1700.53560005 hartree
xcener: -142.756670751903 hartree
chargesum: -0.0000000
charge: -0.097904 -0.271230 -0.414023 -0.326921 -0.084563 0.186207 0.033502 -0.045423 -0.303762 -0.303277 0.322102 -0.206810 -0.179610 0.396173 -0.155554 -0.154565 0.081243 0.104910 -0.296736 -0.209892 0.284928 -0.232331 -0.103210 -0.242612 0.289147 -0.252072 -0.194855 -0.119851 -0.138117 -0.183332 0.092277 0.056801 0.095155 0.098049 0.098821 0.091544 0.097702 0.099254 0.140326 0.139043 0.142536 0.142068 0.142508 0.153347 0.144642 0.159313 0.147486 0.145502 0.155687 0.158503 0.159648 0.158225
qa: -0.0979 -0.2712 -0.4140 -0.3269 -0.0846 0.1862 0.0335 -0.0454 -0.3038 -0.3033 0.3221 -0.2068 -0.1796 0.3962 -0.1556 -0.1546 0.0812 0.1049 -0.2967 -0.2099 0.2849 -0.2323 -0.1032 -0.2426 0.2891 -0.2521 -0.1949 -0.1199 -0.1381 -0.1833 0.0923 0.0568 0.0952 0.0980 0.0988 0.0915 0.0977 0.0993 0.1403 0.1390 0.1425 0.1421 0.1425 0.1533 0.1446 0.1593 0.1475 0.1455 0.1557 0.1585 0.1596 0.1582
va: 1.2066 2.1224 2.0952 2.0795 3.1080 3.6170 3.8244 3.5756 3.9451 3.9361 4.2465 3.9922 4.0066 3.7672 4.0177 3.9953 3.5380 3.8252 3.9285 3.9783 3.7263 4.0745 3.8932 4.0179 3.6798 4.0092 3.9198 3.8801 3.8877 3.9085 1.0333 1.0222 1.0046 1.0006 1.0057 1.0022 1.0049 1.0012 1.0145 1.0046 1.0145 1.0069 1.0063 1.0081 1.0046 0.9887 1.0056 1.0089 0.9985 0.9889 0.9900 0.9905
dispcorr: -0.029223522 hartree
energy: -1706.686483681178
dipole: -14.03252 13.74028 -0.29224 4.36183 -4.36316 -0.00133 -23.92475 22.33612 -1.58863
magnitude: 1.61529 au
magnitude: 4.10573 debye
