program: Gaussian 09
title: 000074688
version: EM64L-G09RevD.01
frameworkgroup: C1[X(C10H9NO2)]
method: RPBEPBE
basis: SDD
operation: Freq
keyword: #p
keyword: freq=noraman
keyword: PBEPBE/SDD
title: #p freq=noraman PBEPBE/SDD
converged: YES YES NO NO
title: Mulliken charges:
elementType: O O N C C C C C C C C C C H H H H H H H H H
charge: -0.444214 -0.173778 -0.404801 0.186619 0.400272 0.222523 -0.415043 -0.633156 -0.570987 -0.314105 0.282085 -0.345815 -0.051979 0.265091 0.305717 0.238767 0.243721 0.219910 0.228964 0.248248 0.162539 0.349423
chargesum: 0.00000
title: Mulliken charges with hydrogens summed into heavy atoms:
elementType: O O N C C C C C C C C C C
charge: -0.094791 -0.173778 -0.099084 0.186619 0.400272 0.222523 -0.149952 -0.150668 -0.351077 -0.085141 0.282085 -0.097567 0.110560
polarizability: 1.53849188e+02 1.02024687e+01 1.32798815e+02 -1.37344667e+01 8.25176928e+00 6.79576233e+01
1716.lowfreq: -12.0987 -6.2575 -0.0012 -0.0007 0.0002 3.5714 10.0241 78.7978 109.0561
frequency: 9.8643 78.7974 109.0551 145.0739 177.0783 203.1337 302.4636 330.3884 349.5283 373.9588 420.6477 438.6355 478.9955 491.2141 520.9089 587.7768 624.8577 645.5022 697.2531 729.1504 752.8214 773.1245 801.7879 805.2453 817.2732 833.4456 907.7312 925.6302 931.1967 991.0701 1055.8937 1099.4594 1122.2430 1145.5658 1174.6995 1212.4181 1237.7006 1253.5629 1289.5672 1318.6169 1339.9527 1381.7553 1398.8116 1427.8042 1442.9880 1464.4437 1484.2434 1568.8044 1603.7582 1639.2636 1657.7266 2830.4023 2938.8640 2994.4708 3119.0233 3138.5814 3174.9982 3219.4604 3586.8773 3617.3848
redmass: 7.3576 6.4827 2.5496 5.3302 4.1914 2.6789 4.4233 1.1686 3.8878 6.8896 2.6770 4.9768 4.1938 1.2658 4.5360 2.4865 4.3518 4.7892 1.6400 3.8304 3.4186 2.0555 2.0131 2.5367 2.1181 2.2301 3.3512 3.3682 1.3362 1.7829 2.6203 1.5062 1.5175 1.2982 1.3152 1.6678 1.8831 1.5926 2.3566 2.1038 1.9639 1.3268 3.0316 1.1902 3.0189 4.0314 4.5374 6.2119 6.2225 7.2820 7.6118 1.0836 1.0658 1.0918 1.0917 1.0896 1.0956 1.0984 1.0660 1.0810
irintensity: 3.9011 3.5494 5.4028 5.8028 1.8228 0.4261 1.4218 128.7784 18.0202 11.2362 17.6078 0.9506 1.7951 100.8257 27.9711 17.5749 2.9471 14.4691 1.5702 8.7081 5.1542 22.1856 36.4624 10.1169 26.7632 19.1217 15.6590 17.2005 0.2354 10.1264 22.0073 54.0695 83.8772 146.0276 6.2286 7.2986 7.3864 13.9762 25.5976 11.6563 19.0029 5.0868 35.6676 21.9935 7.1651 53.9530 60.1720 3.0490 21.0403 29.8162 105.4409 202.1704 60.7114 10.9314 16.5444 10.0682 7.7525 0.9643 30.0457 63.5078
temp: 298.150 k
press: 1.00000 atm
elementType: 8 8 7 6 6 6 6 6 6 6 6 6 6 1 1 1 1 1 1 1 1 1
symmnumber: 1
zpe: 437791.1 jmol-1
zpe.correction: 0.166746 hartree
zpe.thermalcorrener: 0.178114 hartree
zpe.thermalcorrenthalpy: 0.179059 hartree
zpe.thermalcorrgfe: 0.127797 hartree
zpe.sumelectzpe: -590.727944 hartree
zpe.sumelectthermal: -590.716575 hartree
zpe.sumelectthermalent: -590.715631 hartree
zpe.sumelectthermalfe: -590.766892 hartree
dipole: 2.4011 2.3380 -2.5134
dipole: 4.1891
quadrupole: -73.0121 -56.9478 -82.2759
quadrupole: -0.9612 -8.3582 9.0494
quadrupole: -2.2669 13.7975 -11.5306 -0.9612 -8.3582 9.0494
hfenergy: -590.8946896 hartree
pointgroup: C01 [X(C10H9N1O2)]
dipole: 0.9223748 0.8606691 -1.0605799 debye
dipolederiv: -0.5977869 -0.5977598 -0.0582759 -0.7872178 -0.9884306 0.0503233 -0.0942156 0.0128986 -0.4081417 -0.3854158 0.0576446 0.1292475 0.1278286 -0.4049313 0.1096283 -0.0271952 0.204051 -0.7808865 -0.4432498 0.2756206 0.0476276 -0.0571799 -0.6447135 -0.0332936 0.0274835 -0.126677 -0.2882492 0.2717957 0.2818049 0.0214728 -0.0454214 -0.0683133 0.0057938 -0.0437718 -0.0841084 0.0304743 0.052916 -0.1911053 -0.051317 0.0163356 -0.1604337 0.0068152 -0.0377919 0.0384075 -0.151406 -0.1153758 0.172368 0.0525978 0.4807793 0.226297 -0.0448366 0.1061458 0.004904 -0.0141009 -0.0131559 -0.3998361 -0.1016005 -0.3020519 0.373893 0.1477398 -0.066114 0.1927485 -0.1148247 0.1446585 0.035854 -0.0402623 0.0329817 -0.0406275 0.2388556 -0.1706913 0.2994076 -0.1738489 -0.2090729 -0.2691049 -0.0472333 -0.0061876 -0.0710963 0.00508 0.0160851 0.0515319 -0.2111504 0.2762335 -0.0314627 -0.0915191 0.1068729 0.0580548 0.0199857 -0.0735072 0.0473567 -0.1393458 0.4481911 0.5169239 0.0035983 0.7672138 0.9889421 0.0056616 0.0374482 0.0427771 0.0647486 -0.0670275 0.0269761 -0.0275851 -0.3494096 -0.2188344 0.0648394 -0.0874122 -0.0052091 -0.1762768 0.4610003 -0.3447437 -0.1623085 -0.4713981 0.6285536 -0.2839058 -0.0280295 -0.2936925 0.9449252 -0.0017936 -0.0717092 0.0346796 -0.0675877 0.0585592 -0.015967 0.0304352 -0.0120632 0.1905688 0.1548436 0.0208759 0.0413026 0.0035058 0.2264786 -0.0242802 0.0428781 -0.0249179 0.3312843 0.0648642 0.0168829 -0.0770996 0.0812686 -0.0449029 -0.1135328 0.029023 -0.1088527 -0.0074086 -0.1069967 -0.0038692 0.0446833 -0.0673954 0.0295025 0.0644963 0.0337353 -0.0078032 0.1212594 0.0624695 0.0602828 0.0351939 0.0374144 -0.0980611 -0.0475663 0.0276291 -0.0452778 0.1503868 0.0492256 0.0504294 0.0334366 0.0874312 -0.0713524 -0.060176 0.0397257 -0.0540621 0.1529973 -0.0630681 0.0005062 0.0499473 -0.0098274 0.1036645 -0.0103511 0.0512964 -0.0116137 0.1607276 -0.162343 0.2023312 0.1004112 0.2661601 -0.1479275 -0.0434034 0.1212064 -0.0756809 -0.0374476 0.1790879 0.1910902 0.0630028 0.1558849 0.2656791 -0.0419061 0.0656368 -0.0441242 0.3557146 unknown
polarizability: 152.9735515|9.4471118|132.7875096|-17.6290932|5.9959028|68.844565 unknown
InChI: InChI=1S/C10H9NO2/c12-4-3-7-6-11-10-2-1-8(13)5-9(7)10/h1-2,4-6,11,13H,3H2
charge 0 multiplicity 1
22 atoms
O  -2.999756 -2.115122 -0.004505
O  2.475031 -1.698297 1.276215
N  0.336073 2.363406 0.065267
C  -0.005227 0.12581 -0.258585
C  1.39376 0.420995 -0.511489
C  -0.646465 1.362913 0.09662
C  1.558878 1.791784 -0.301445
C  2.462879 -0.547476 -0.928052
C  -0.775908 -1.067368 -0.302097
C  -2.024224 1.435344 0.399502
C  -2.147852 -0.98749 0.003723
C  -2.772958 0.246874 0.348173
C  2.899215 -1.589816 0.105319
H  2.460205 2.396962 -0.385314
H  0.183551 3.346423 0.276556
H  2.163117 -1.12483 -1.831927
H  3.387575 -0.014328 -1.234995
H  -0.30996 -2.030514 -0.546306
H  -2.506643 2.380814 0.670074
H  -3.842487 0.238926 0.57672
H  3.677234 -2.299121 -0.289898
H  -2.485537 -2.935691 -0.205256
