program: Orca
programVersion: 5.0.2
elementType: Cl O O O N C C C C C C C C C C C C C C C C C C C C C C C C C H H H H H H H H H H H H H H H H H H H H H H
charge: 0
multiplicity: 1
keywords: wb97x-d3
keywords: def2-TZVPP
keywords: def2/J RIJCOSX
keywords: DEFGRID2
keywords: scfconv7
keywords: smallprint printgap noloewdin
keywords: NOSOSCF
formula: C25H22ClNO3
InChI: InChI=1/C25H22ClNO3/c1-17(2)24(18-11-13-20(26)14-12-18)25(28)30-23(16-27)19-7-6-10-22(15-19)29-21-8-4-3-5-9-21/h3-15,17,23-24H,1-2H3
52 atoms
Cl -3.085649 -2.773293 -0.893737
O  2.847565 0.432757 -0.47302
O  2.668362 0.699586 1.730306
O  -2.014129 1.392925 -1.248229
N  4.696106 3.106322 0.528997
C  2.561817 -1.534736 0.817385
C  3.676681 -2.280853 0.06132
C  1.152612 -1.855827 0.359725
C  5.045473 -1.888251 0.607141
C  3.469443 -3.785564 0.182487
C  2.708143 -0.031273 0.77849
C  0.809285 -1.933199 -0.987495
C  0.155046 -2.053276 1.308965
C  2.745946 1.837378 -0.662524
C  -0.491395 -2.210492 -1.378275
C  -1.151273 -2.332121 0.935896
C  1.360691 2.352549 -0.336112
C  -1.464147 -2.4101 -0.410886
C  0.288182 1.667548 -0.89822
C  1.131891 3.452844 0.475548
C  -1.005877 2.082241 -0.637609
C  3.82278 2.540697 0.042881
C  -0.172314 3.870793 0.710049
C  -1.248026 3.194344 0.160827
C  -3.104916 0.986177 -0.529422
C  -3.041177 0.668572 0.821553
C  -4.293506 0.849401 -1.233585
C  -4.185553 0.217361 1.463898
C  -5.425206 0.387264 -0.579864
C  -5.379687 0.073753 0.771872
H  2.640144 -1.806332 1.873982
H  3.640062 -2.013169 -0.998428
H  5.127628 -2.121095 1.671445
H  5.834138 -2.435814 0.089118
H  5.263483 -0.825274 0.482127
H  3.460007 -4.099399 1.229081
H  4.277129 -4.32339 -0.316064
H  2.533572 -4.11341 -0.271035
H  1.556713 -1.786313 -1.75672
H  0.398195 -1.996012 2.363078
H  2.938912 1.978369 -1.729343
H  -0.738564 -2.273904 -2.429529
H  -1.910745 -2.488339 1.690094
H  0.446099 0.810827 -1.541541
H  1.952393 3.993725 0.929313
H  -0.351179 4.735309 1.335556
H  -2.259437 3.530797 0.351122
H  -2.114846 0.760407 1.374241
H  -4.326881 1.097562 -2.287269
H  -4.135056 -0.029631 2.516734
H  -6.34959 0.278351 -1.132649
H  -6.265998 -0.282122 1.280612
elementType: Cl O N C H
totalener: -1706.65478144 hartree
nucrepener: 3084.91278682 hartree
electener: -4791.56756827 hartree
oneelecener: -8464.79192526 hartree
twoeener: 3673.22435699 hartree
cpcmener: -0.03426682 hartree
kineticenergy: 1700.54237480 hartree
xcener: -142.764714730736 hartree
chargesum: -0.0000000
charge: -0.098107 -0.274047 -0.406668 -0.330158 -0.077705 0.185543 0.036667 0.033601 -0.295504 -0.295613 0.309643 -0.282477 -0.195498 0.449820 -0.139995 -0.178719 -0.011474 0.140164 -0.302898 -0.177881 0.253967 -0.247775 -0.120913 -0.179074 0.330045 -0.202577 -0.273949 -0.155672 -0.116903 -0.186710 0.099947 0.054770 0.093994 0.094433 0.092095 0.091380 0.095933 0.099348 0.145375 0.139839 0.142707 0.141610 0.142249 0.159724 0.134126 0.160539 0.158784 0.147975 0.143715 0.158679 0.156325 0.157321
qa: -0.0981 -0.2740 -0.4067 -0.3302 -0.0777 0.1855 0.0367 0.0336 -0.2955 -0.2956 0.3096 -0.2825 -0.1955 0.4498 -0.1400 -0.1787 -0.0115 0.1402 -0.3029 -0.1779 0.2540 -0.2478 -0.1209 -0.1791 0.3300 -0.2026 -0.2739 -0.1557 -0.1169 -0.1867 0.0999 0.0548 0.0940 0.0944 0.0921 0.0914 0.0959 0.0993 0.1454 0.1398 0.1427 0.1416 0.1422 0.1597 0.1341 0.1605 0.1588 0.1480 0.1437 0.1587 0.1563 0.1573
va: 1.2069 2.1188 2.1013 2.0478 3.1035 3.6112 3.8358 3.4787 3.9452 3.9293 4.2094 3.9520 4.0220 3.8670 3.9886 3.9544 3.7494 3.7598 4.0395 3.9287 3.7842 4.0814 3.9177 3.9465 3.5739 3.8530 4.0196 3.8896 3.8784 3.9058 1.0285 1.0226 1.0032 1.0037 1.0096 1.0025 1.0053 1.0016 1.0104 1.0056 0.9918 1.0068 1.0075 1.0061 1.0164 0.9904 0.9942 1.0037 1.0088 0.9899 0.9883 0.9892
dispcorr: -0.034444549 hartree
energy: -1706.689225993829
dipole: 15.13229 -15.92425 -0.79196 -8.54864 7.45774 -1.09090 5.50644 -6.34595 -0.83951
magnitude: 1.58809 au
magnitude: 4.03660 debye
