program: Gaussian 09
title: 000074722
version: EM64L-G09RevD.01
frameworkgroup: C1[X(C8H8Cl6Si2)]
method: RPBEPBE
basis: SDD
operation: Freq
keyword: #p
keyword: freq=noraman
keyword: PBEPBE/SDD
title: #p freq=noraman PBEPBE/SDD
converged: NO YES NO NO
title: Mulliken charges:
elementType: Cl Cl Cl Cl Cl Cl Si Si C C C C C C C C H H H H H H H H
charge: -0.210653 -0.199501 -0.216374 -0.200131 -0.202701 -0.220159 0.866125 0.833025 -1.033935 -0.527995 0.498872 -0.410851 -0.382075 -0.217805 -0.225398 -0.233658 0.374649 0.273730 0.262899 0.247909 0.227077 0.232223 0.230591 0.234137
chargesum: 0.00000
title: Mulliken charges with hydrogens summed into heavy atoms:
elementType: Cl Cl Cl Cl Cl Cl Si Si C C C C C C C C
charge: -0.210653 -0.199501 -0.216374 -0.200131 -0.202701 -0.220159 0.866125 0.833025 -0.659287 0.008635 0.498872 -0.162942 -0.154999 0.014418 0.005194 0.000478
polarizability: 2.26352178e+02 -3.54499149e+00 1.56149310e+02 6.68397139e-01 -1.24401572e+01 1.68313484e+02
1716.lowfreq: -9.0826 -5.9633 -4.6923 -0.0037 -0.0024 -0.0012 20.3037 25.0970 32.9403
frequency: 20.0987 24.9247 32.9138 50.3521 57.5775 82.8610 92.1431 99.8727 109.6830 115.5320 138.1350 151.1312 157.7668 160.9987 170.8208 200.3308 229.3461 270.4914 333.4385 350.8776 393.8510 402.5833 426.7749 487.3791 495.7361 510.1924 534.0469 547.8198 571.0930 616.2888 653.3299 704.5017 757.0375 768.2981 826.4746 853.5978 912.5598 943.7128 964.9269 978.7505 990.4079 999.8812 1027.7054 1079.5041 1136.8379 1158.2398 1175.7118 1191.8857 1212.9465 1267.4801 1321.6800 1341.8031 1385.9225 1442.7814 1469.7119 1485.1629 1594.8723 1613.8937 2997.0087 2999.6394 3066.4827 3106.9677 3128.4717 3138.7503 3150.4612 3167.5297
redmass: 12.0979 6.9891 21.8009 5.3899 7.5729 18.2320 18.6582 16.4654 12.4069 23.3089 8.9619 12.7520 20.7341 26.6005 24.7805 7.5637 17.5299 18.8833 2.3083 5.4155 11.9469 2.8261 8.7435 4.2739 16.8585 20.7420 26.1517 8.4988 6.8208 6.3627 5.4864 1.8531 1.8213 5.2764 3.2866 1.2552 1.4818 1.7485 5.6968 1.4047 5.9800 1.3270 2.2077 1.5466 1.1385 1.1612 1.0528 1.1235 2.7840 1.2193 1.2642 1.2658 7.0219 2.1285 1.1322 2.1357 5.9936 6.0653 1.0721 1.0700 1.1005 1.0889 1.0861 1.0908 1.0958 1.1015
irintensity: 0.1503 0.0680 0.1208 0.0210 0.6662 0.6039 0.5226 1.4952 0.0946 0.4572 2.5147 4.7151 6.9523 11.8020 2.4694 7.2176 12.1098 2.3050 1.6376 4.1555 69.1153 0.8372 28.8711 57.9027 47.3776 3.1848 100.1712 134.4304 41.0583 0.1207 87.2037 38.8851 106.3891 83.5645 16.0347 0.5757 3.0795 11.5049 33.1925 0.2489 1.5444 0.1106 4.1479 6.7263 7.6484 21.1603 0.3726 0.4139 1.3945 2.2172 1.4416 0.0391 0.1630 8.6053 20.2526 11.2392 1.9328 2.9550 4.0322 3.0886 3.5106 10.9272 1.4157 7.8836 27.9522 21.7280
temp: 298.150 k
press: 1.00000 atm
elementType: 17 17 17 17 17 17 14 14 6 6 6 6 6 6 6 6 1 1 1 1 1 1 1 1
symmnumber: 1
zpe: 381907.7 jmol-1
zpe.correction: 0.145461 hartree
zpe.thermalcorrener: 0.165056 hartree
zpe.thermalcorrenthalpy: 0.166000 hartree
zpe.thermalcorrgfe: 0.092724 hartree
zpe.sumelectzpe: -3647.821787 hartree
zpe.sumelectthermal: -3647.802192 hartree
zpe.sumelectthermalent: -3647.801248 hartree
zpe.sumelectthermalfe: -3647.874525 hartree
dipole: -3.2301 2.1153 -0.3333
dipole: 3.8754
quadrupole: -151.6048 -161.0105 -151.6267
quadrupole: -3.4684 0.4011 -4.0160
quadrupole: 3.1425 -6.2631 3.1206 -3.4684 0.4011 -4.0160
hfenergy: -3647.9672484 hartree
pointgroup: C01 [X(C8H8Cl6Si2)]
dipole: 1.4017462 0.5262156 0.2879937 debye
dipolederiv: -0.644781 -0.1956839 0.0671092 -0.1990431 -0.4927266 0.0238839 0.0853081 0.0399395 -0.273767 -0.5467371 0.1798619 -0.1379086 0.1423204 -0.4991872 0.0772235 -0.1662663 0.119558 -0.346145 -0.3255032 -0.0097341 0.0474006 -0.0281999 -0.3594402 -0.0143622 0.1075819 -0.0553926 -0.6820029 -0.4751855 0.0462949 -0.1474141 0.0325613 -0.3194503 -0.0573426 -0.2730935 -0.0253379 -0.6068838 -0.5810771 -0.0008075 0.1912603 -0.0597671 -0.3417905 0.1083815 0.3215562 0.0848879 -0.5475738 -0.420219 -0.0086574 0.0116629 0.0636385 -0.8197103 -0.0801569 0.0120786 -0.0754791 -0.295909 1.7863008 0.0931291 0.0663348 0.0115754 1.6052827 -0.0594945 -0.0624763 -0.0640238 1.4712927 1.6827561 -0.2131662 -0.1165107 -0.0457907 1.7250939 0.0477168 -0.0036979 0.0002022 1.626494 -0.6383746 0.0579207 0.0250986 0.0234495 -0.5559562 0.0352141 0.0802282 0.0289341 -0.5314119 0.0609892 0.1007793 0.043013 0.2338554 -0.0698853 -0.0287165 -0.1637431 -0.1088293 0.1219066 0.1633913 -0.0137145 0.0336598 -0.1870488 -0.0418978 0.0268054 0.1000463 0.0364678 -0.0431537 -0.1655231 -0.0204656 0.0707048 -0.0521545 -0.1249819 0.0451713 -0.0071386 0.0305563 0.0216591 -0.1284416 -0.0597987 -0.0684193 -0.0614473 -0.1133813 0.0432579 -0.0186228 0.0569028 -0.0046222 0.0014281 -0.0703928 -0.0810538 -0.0737672 -0.0891767 0.0736973 -0.1048155 0.0683282 0.0449338 -0.0524667 -0.0201985 0.0711234 0.0036144 -0.1129116 0.0393511 0.1076471 0.046748 0.1169737 0.0787655 -0.0826064 0.0482823 -0.0793562 -0.1202883 0.0018121 0.0332223 0.0038569 -0.067408 0.0688877 0.0267656 -0.0531613 0.0229502 0.0317797 -0.0419146 0.0177905 0.0112655 0.0084169 0.0414817 -0.0057569 -0.0193305 -0.0099819 0.1194488 -0.0250446 -0.0388516 0.0265929 -0.056134 0.040608 -0.0286379 -0.0100393 -0.0131477 -0.0426372 -0.0204181 0.0183932 -0.0224985 0.0709623 0.0784178 0.0213506 -0.0974111 0.0209699 0.1353242 -0.0359961 -0.0785144 -0.0358374 -0.0338941 0.0171835 0.0786734 0.0950657 0.0807681 0.0992716 -0.0491483 0.091624 -0.0493858 0.0085003 0.0087939 0.0543581 0.068688 0.0837461 0.1152841 -0.0675609 0.0854416 -0.0667719 -0.0119446 0.0498774 0.0068396 -0.0649955 0.0148812 0.1363441 -0.0402404 -0.094167 -0.0442558 -0.0769759 -0.1005721 0.0636471 -0.0431592 0.0753739 0.1355922 -0.0021194 -0.049531 -0.0064282 0.0866867 unknown
polarizability: 225.1636738|-10.1983369|152.0986541|0.9799207|7.7380013|173.5526434 unknown
InChI: InChI=1S/C8H8Cl6Si2/c9-15(10,11)8(16(12,13)14)6-7-4-2-1-3-5-7/h1-5,8H,6H2
charge 0 multiplicity 1
24 atoms
Cl -2.740159 -2.668911 0.115133
Cl 0.694642 -2.715464 0.670652
Cl -0.585104 -1.705417 -2.479254
Cl -3.667763 0.743275 -1.649292
Cl -3.901127 0.301481 1.881202
Cl -2.422126 3.170946 0.564736
Si -0.888896 -1.616825 -0.327559
Si -2.666429 1.024336 0.253766
C  -0.935095 0.207461 0.263312
C  0.126487 1.093373 -0.489763
C  1.564584 0.682425 -0.18952
C  2.397834 0.140928 -1.199386
C  2.098085 0.86821 1.112493
C  3.73343 -0.222202 -0.910081
C  3.429781 0.505561 1.403845
C  4.251742 -0.045232 0.391919
H  -0.659033 0.162262 1.337968
H  -0.068536 1.064265 -1.576592
H  -0.022976 2.139989 -0.162814
H  2.002878 -0.001938 -2.211878
H  1.474208 1.310339 1.901045
H  4.364718 -0.643924 -1.699833
H  3.828994 0.656062 2.412955
H  5.28586 -0.328201 0.616844
