program: Orca
programVersion: 5.0.2
elementType: Cl O O O N C C C C C C C C C C C C C C C C C C C C C C C C C H H H H H H H H H H H H H H H H H H H H H H
charge: 0
multiplicity: 1
keywords: wb97x-d3
keywords: def2-TZVPP
keywords: def2/J RIJCOSX
keywords: DEFGRID2
keywords: scfconv7
keywords: smallprint printgap noloewdin
keywords: NOSOSCF
formula: C25H22ClNO3
InChI: InChI=1/C25H22ClNO3/c1-17(2)24(18-11-13-20(26)14-12-18)25(28)30-23(16-27)19-7-6-10-22(15-19)29-21-8-4-3-5-9-21/h3-15,17,23-24H,1-2H3
52 atoms
Cl -3.201926 -3.089195 -1.198178
O  2.281669 0.634021 0.978139
O  3.200924 0.158684 -1.003616
O  -2.344348 2.064326 -0.82971
N  2.096797 3.289041 2.940992
C  2.417517 -1.641336 0.41361
C  3.432832 -2.62763 -0.189441
C  0.988021 -1.941009 0.01315
C  4.83906 -2.347879 0.332661
C  3.032391 -4.064435 0.126428
C  2.705533 -0.209369 0.022218
C  0.578505 -1.83539 -1.31268
C  0.065175 -2.365566 0.960906
C  2.345771 2.017956 0.671629
C  -0.70986 -2.177658 -1.688621
C  -1.227559 -2.711011 0.60104
C  1.256108 2.457365 -0.276715
C  -1.601555 -2.627576 -0.72848
C  -0.043086 2.003058 -0.081613
C  1.556924 3.337412 -1.301187
C  -1.051504 2.459432 -0.918772
C  2.208136 2.711275 1.954758
C  0.539824 3.7829 -2.133287
C  -0.759887 3.354757 -1.944637
C  -2.8217 1.436442 0.289055
C  -3.470132 0.226482 0.111502
C  -2.725848 2.013362 1.548991
C  -4.035056 -0.412451 1.204795
C  -3.282869 1.35822 2.635888
C  -3.93981 0.146695 2.469545
H  2.480565 -1.710746 1.504644
H  3.434036 -2.497527 -1.275518
H  5.550768 -3.060521 -0.084764
H  5.193083 -1.351544 0.070094
H  4.880995 -2.447778 1.419925
H  3.781047 -4.759569 -0.253277
H  2.07581 -4.335832 -0.31749
H  2.956116 -4.225273 1.204216
H  1.269117 -1.48624 -2.06991
H  0.358672 -2.438748 2.000674
H  3.323385 2.275968 0.251171
H  -1.015529 -2.098102 -2.72256
H  -1.934583 -3.041122 1.348808
H  -0.26175 1.299977 0.711929
H  2.574654 3.671625 -1.454769
H  0.763014 4.471425 -2.936767
H  -1.558037 3.700887 -2.587803
H  -3.538086 -0.204634 -0.877789
H  -2.225047 2.963977 1.681682
H  -4.542252 -1.357045 1.059871
H  -3.20793 1.804916 3.618312
H  -4.378849 -0.354435 3.321729
totalener: -1706.63216344 hartree
nucrepener: 3064.02844699 hartree
electener: -4770.66061043 hartree
oneelecener: -8422.34590156 hartree
twoeener: 3651.68529113 hartree
kineticenergy: 1700.62179102 hartree
xcener: -142.771514382821 hartree
chargesum: 0.0000000
charge: -0.081964 -0.263751 -0.338284 -0.293842 -0.001250 0.082674 0.056798 -0.047819 -0.275813 -0.282396 0.277214 -0.138264 -0.137197 0.295381 -0.150238 -0.118014 0.095692 0.089437 -0.270237 -0.170091 0.290119 -0.254634 -0.074143 -0.226720 0.271622 -0.182633 -0.194039 -0.127769 -0.103013 -0.140124 0.084871 0.048356 0.085385 0.099405 0.081856 0.091780 0.100242 0.078245 0.130289 0.108129 0.125471 0.123185 0.116490 0.131664 0.104909 0.126590 0.127900 0.128715 0.137288 0.124451 0.131195 0.126886
qa: -0.0820 -0.2638 -0.3383 -0.2938 -0.0012 0.0827 0.0568 -0.0478 -0.2758 -0.2824 0.2772 -0.1383 -0.1372 0.2954 -0.1502 -0.1180 0.0957 0.0894 -0.2702 -0.1701 0.2901 -0.2546 -0.0741 -0.2267 0.2716 -0.1826 -0.1940 -0.1278 -0.1030 -0.1401 0.0849 0.0484 0.0854 0.0994 0.0819 0.0918 0.1002 0.0782 0.1303 0.1081 0.1255 0.1232 0.1165 0.1317 0.1049 0.1266 0.1279 0.1287 0.1373 0.1245 0.1312 0.1269
va: 1.2285 2.1368 2.1566 2.1234 3.1213 3.7741 3.8147 3.5475 3.9322 3.9515 4.2772 3.9709 4.0016 3.8508 4.0461 3.9825 3.6300 3.8985 3.9680 4.0429 3.8003 4.0266 3.9465 4.0447 3.7893 3.9762 3.9718 3.8914 3.9387 3.9716 1.0383 1.0271 1.0078 1.0142 1.0038 1.0080 1.0031 1.0047 1.0205 1.0118 1.0186 1.0133 1.0168 1.0170 1.0133 0.9998 1.0135 1.0209 1.0030 1.0132 0.9983 0.9998
dispcorr: -0.032815846 hartree
energy: -1706.664979284267
dipole: 20.00422 -19.76894 0.23528 -9.80985 8.91984 -0.89001 3.98375 -4.43144 -0.44769
magnitude: 1.02367 au
magnitude: 2.60195 debye
