program: Orca
programVersion: 5.0.2
elementType: Cl O O O N C C C C C C C C C C C C C C C C C C C C C C C C C H H H H H H H H H H H H H H H H H H H H H H
charge: 0
multiplicity: 1
keywords: wb97x-d3
keywords: def2-TZVPP
keywords: def2/J RIJCOSX
keywords: DEFGRID2
keywords: scfconv7
keywords: smallprint printgap noloewdin
keywords: NOSOSCF
formula: C25H22ClNO3
InChI: InChI=1/C25H22ClNO3/c1-17(2)24(18-11-13-20(26)14-12-18)25(28)30-23(16-27)19-7-6-10-22(15-19)29-21-8-4-3-5-9-21/h3-15,17,23-24H,1-2H3
52 atoms
Cl -2.769029 -3.152067 -0.93344
O  2.737332 0.617936 0.822279
O  3.50216 -0.048306 -1.174648
O  -2.189573 2.516069 0.931596
N  3.026888 3.497609 2.408166
C  2.90539 -1.698852 0.484977
C  3.951224 -2.702145 -0.024394
C  1.477622 -2.062799 0.12888
C  5.354901 -2.285949 0.404074
C  3.636076 -4.102424 0.489431
C  3.115546 -0.307327 -0.069803
C  1.097211 -2.236837 -1.199106
C  0.514057 -2.207903 1.118605
C  2.589811 1.956318 0.345881
C  -0.204523 -2.570331 -1.529907
C  -0.795473 -2.538564 0.804393
C  1.211735 2.138661 -0.238073
C  -1.144011 -2.72285 -0.522407
C  0.11102 2.245268 0.601948
C  1.039516 2.104459 -1.614748
C  -1.161377 2.335742 0.061908
C  2.831551 2.814492 1.506155
C  -0.240196 2.187867 -2.143738
C  -1.344053 2.305165 -1.316868
C  -3.377868 1.868295 0.748171
C  -3.450992 0.551407 0.311457
C  -4.528392 2.568388 1.081606
C  -4.692854 -0.057673 0.211292
C  -5.760926 1.9428 0.984849
C  -5.84993 0.630069 0.545979
H  2.980087 -1.648974 1.57593
H  3.916638 -2.715604 -1.117487
H  6.091326 -3.011714 0.058039
H  5.645391 -1.317103 -0.001036
H  5.434826 -2.23643 1.492451
H  3.645032 -4.132187 1.581607
H  4.38358 -4.814381 0.138641
H  2.661378 -4.457508 0.156191
H  1.820826 -2.106739 -1.993523
H  0.784655 -2.064305 2.15715
H  3.351724 2.183364 -0.405648
H  -0.48775 -2.70762 -2.564127
H  -1.534869 -2.650932 1.585197
H  0.228913 2.275229 1.678492
H  1.894694 2.003433 -2.269119
H  -0.380127 2.167357 -3.21607
H  -2.337432 2.380666 -1.739654
H  -2.554203 -0.001155 0.059252
H  -4.448858 3.592502 1.42173
H  -4.746317 -1.084116 -0.124458
H  -6.656063 2.489471 1.250531
H  -6.813229 0.144558 0.469353
totalener: -1706.63255400 hartree
nucrepener: 2998.02419119 hartree
electener: -4704.65674519 hartree
oneelecener: -8290.10739479 hartree
twoeener: 3585.45064960 hartree
kineticenergy: 1700.60779295 hartree
xcener: -142.766325744329 hartree
chargesum: 0.0000000
charge: -0.084339 -0.249276 -0.358608 -0.294825 0.000179 0.086620 0.045273 -0.024848 -0.276352 -0.279213 0.295267 -0.168737 -0.128120 0.313717 -0.133140 -0.159561 0.020884 0.105856 -0.199314 -0.136391 0.198414 -0.266771 -0.114815 -0.136601 0.225604 -0.149645 -0.200552 -0.118014 -0.097064 -0.147269 0.086424 0.048668 0.085135 0.100397 0.084021 0.079703 0.090913 0.099543 0.127033 0.111408 0.124044 0.123527 0.125744 0.118846 0.122084 0.129996 0.134770 0.136361 0.126715 0.125529 0.125438 0.125343
qa: -0.0843 -0.2493 -0.3586 -0.2948 0.0002 0.0866 0.0453 -0.0248 -0.2764 -0.2792 0.2953 -0.1687 -0.1281 0.3137 -0.1331 -0.1596 0.0209 0.1059 -0.1993 -0.1364 0.1984 -0.2668 -0.1148 -0.1366 0.2256 -0.1496 -0.2006 -0.1180 -0.0971 -0.1473 0.0864 0.0487 0.0851 0.1004 0.0840 0.0797 0.0909 0.0995 0.1270 0.1114 0.1240 0.1235 0.1257 0.1188 0.1221 0.1300 0.1348 0.1364 0.1267 0.1255 0.1254 0.1253
va: 1.2224 2.1462 2.1339 2.1130 3.1152 3.7430 3.8280 3.5644 3.9319 3.9452 4.2779 4.0107 3.9905 3.8228 4.0456 3.9883 3.6600 3.8719 4.0728 3.9533 3.9177 4.0380 3.9551 3.9482 3.8619 3.9414 4.0185 3.9600 3.9472 4.0020 1.0378 1.0256 1.0070 1.0138 1.0041 1.0051 1.0077 1.0039 1.0212 1.0110 1.0184 1.0125 1.0132 1.0294 1.0204 1.0005 1.0022 0.9911 1.0140 1.0155 0.9987 1.0012
dispcorr: -0.030992361 hartree
energy: -1706.663546362248
dipole: 16.36568 -16.67439 -0.30871 -10.96783 9.79985 -1.16799 0.34301 -1.20403 -0.86102
magnitude: 1.48353 au
magnitude: 3.77083 debye
