program: Orca
programVersion: 5.0.2
elementType: Cl O O O N C C C C C C C C C C C C C C C C C C C C C C C C C H H H H H H H H H H H H H H H H H H H H H H
charge: 0
multiplicity: 1
keywords: wb97x-d3
keywords: def2-TZVPP
keywords: def2/J RIJCOSX
keywords: DEFGRID2
keywords: scfconv7
keywords: smallprint printgap noloewdin
keywords: NOSOSCF
formula: C25H22ClNO3
InChI: InChI=1/C25H22ClNO3/c1-17(2)24(18-11-13-20(26)14-12-18)25(28)30-23(16-27)19-7-6-10-22(15-19)29-21-8-4-3-5-9-21/h3-15,17,23-24H,1-2H3
52 atoms
Cl -2.632597 -2.568776 2.030231
O  3.023966 0.642192 0.200725
O  2.522629 -0.024372 -1.879877
O  -2.012779 2.12687 -1.436307
N  4.216568 3.533335 1.276235
C  2.909564 -1.674757 -0.159666
C  3.412341 -2.717824 -1.166984
C  1.521242 -1.942332 0.387893
C  4.829769 -2.385616 -1.623479
C  3.366649 -4.112948 -0.553278
C  2.817208 -0.283781 -0.747876
C  1.288616 -1.926996 1.757004
C  0.442438 -2.148686 -0.467192
C  2.63048 1.981206 -0.100297
C  0.016925 -2.1230 2.272337
C  -0.832823 -2.355089 0.030957
C  1.179293 2.177507 0.261928
C  -1.037512 -2.336459 1.401601
C  0.217976 2.071966 -0.733346
C  0.798497 2.373401 1.583502
C  -1.126804 2.179681 -0.407494
C  3.51991 2.843947 0.677942
C  -0.546032 2.483705 1.895336
C  -1.514904 2.392918 0.909158
C  -3.208138 1.481119 -1.302935
C  -3.36181 0.330829 -0.539095
C  -4.276176 1.996576 -2.023664
C  -4.598153 -0.296268 -0.500007
C  -5.502675 1.35322 -1.982619
C  -5.672194 0.207797 -1.218473
H  3.606441 -1.647599 0.684252
H  2.760114 -2.701084 -2.044726
H  4.88877 -1.424304 -2.132972
H  5.5201 -2.363321 -0.776933
H  5.19458 -3.141269 -2.319653
H  3.990741 -4.170608 0.341713
H  3.741424 -4.853551 -1.260161
H  2.356604 -4.408478 -0.271339
H  2.111558 -1.753371 2.438969
H  0.58722 -2.142116 -1.539903
H  2.790292 2.199972 -1.160116
H  -0.150549 -2.104359 3.340174
H  -1.662487 -2.5179 -0.643358
H  0.502014 1.902652 -1.764045
H  1.543013 2.455831 2.364878
H  -0.84775 2.651784 2.92026
H  -2.561751 2.492073 1.164493
H  -2.53045 -0.078316 0.020143
H  -4.136889 2.89163 -2.615561
H  -4.71171 -1.19141 0.097066
H  -6.331829 1.756486 -2.548891
H  -6.632183 -0.288977 -1.185209
totalener: -1706.63189253 hartree
nucrepener: 3020.51620975 hartree
electener: -4727.14810228 hartree
oneelecener: -8335.02519680 hartree
twoeener: 3607.87709452 hartree
kineticenergy: 1700.60728085 hartree
xcener: -142.767814494623 hartree
chargesum: 0.0000000
charge: -0.080847 -0.248567 -0.354227 -0.295886 -0.002187 0.087583 0.044514 -0.000651 -0.277889 -0.276251 0.288790 -0.149339 -0.171306 0.298408 -0.137656 -0.192323 0.026329 0.131891 -0.186355 -0.166071 0.224963 -0.259269 -0.107400 -0.154132 0.236235 -0.153116 -0.200487 -0.115646 -0.100314 -0.142354 0.087165 0.048510 0.101577 0.083208 0.085294 0.079971 0.090184 0.099775 0.110061 0.129345 0.125524 0.121814 0.136565 0.125115 0.118468 0.130533 0.135565 0.128157 0.125401 0.120178 0.125287 0.125864
qa: -0.0808 -0.2486 -0.3542 -0.2959 -0.0022 0.0876 0.0445 -0.0007 -0.2779 -0.2763 0.2888 -0.1493 -0.1713 0.2984 -0.1377 -0.1923 0.0263 0.1319 -0.1864 -0.1661 0.2250 -0.2593 -0.1074 -0.1541 0.2362 -0.1531 -0.2005 -0.1156 -0.1003 -0.1424 0.0872 0.0485 0.1016 0.0832 0.0853 0.0800 0.0902 0.0998 0.1101 0.1293 0.1255 0.1218 0.1366 0.1251 0.1185 0.1305 0.1356 0.1282 0.1254 0.1202 0.1253 0.1259
va: 1.2313 2.1403 2.1376 2.1194 3.1158 3.7243 3.8298 3.5514 3.9340 3.9428 4.2839 4.0264 3.9873 3.8311 4.0309 3.9737 3.6467 3.8539 4.0014 4.0129 3.8777 4.0314 3.9438 3.9450 3.8766 3.9258 4.0149 3.9591 3.9495 3.9961 1.0362 1.0257 1.0132 1.0044 1.0070 1.0051 1.0077 1.0041 1.0124 1.0188 1.0200 1.0126 1.0060 1.0314 1.0173 1.0003 1.0018 0.9926 1.0144 1.0176 0.9988 1.0008
dispcorr: -0.031817505 hartree
energy: -1706.663710035789
dipole: 13.03350 -13.72470 -0.69120 -12.80189 11.65955 -1.14234 -9.45253 9.44361 -0.00892
magnitude: 1.33521 au
magnitude: 3.39383 debye
