program: Orca
programVersion: 5.0.2
elementType: Cl O O O N C C C C C C C C C C C C C C C C C C C C C C C C C H H H H H H H H H H H H H H H H H H H H H H
charge: 0
multiplicity: 1
keywords: wb97x-d3
keywords: def2-TZVPP
keywords: def2/J RIJCOSX
keywords: DEFGRID2
keywords: scfconv7
keywords: smallprint printgap noloewdin
keywords: NOSOSCF
formula: C25H22ClNO3
InChI: InChI=1/C25H22ClNO3/c1-17(2)24(18-11-13-20(26)14-12-18)25(28)30-23(16-27)19-7-6-10-22(15-19)29-21-8-4-3-5-9-21/h3-15,17,23-24H,1-2H3
52 atoms
Cl -2.607737 -3.094743 0.09807
O  2.872131 0.728515 0.847227
O  3.484151 0.391014 -1.276883
O  -2.187657 0.719258 0.391216
N  2.336091 3.358509 2.780418
C  3.204166 -1.504382 0.204583
C  4.096026 -2.385137 -0.682776
C  1.738542 -1.89241 0.1774
C  5.564127 -1.996197 -0.531888
C  3.903871 -3.858312 -0.337589
C  3.241086 -0.044566 -0.188106
C  0.98641 -1.761169 -0.986571
C  1.112089 -2.374221 1.319459
C  2.468035 2.05226 0.521828
C  -0.35183 -2.115993 -1.014976
C  -0.22522 -2.738308 1.306286
C  1.129444 2.048198 -0.177071
C  -0.948493 -2.610138 0.133144
C  0.050023 1.41453 0.42552
C  0.989428 2.649664 -1.417441
C  -1.174934 1.387078 -0.220929
C  2.400076 2.769518 1.796594
C  -0.242469 2.618856 -2.053921
C  -1.32597 1.988897 -1.467051
C  -3.462643 1.206649 0.295909
C  -3.747034 2.547004 0.527223
C  -4.477692 0.307471 0.00793
C  -5.060606 2.982951 0.458383
C  -5.788619 0.756815 -0.04926
C  -6.085855 2.093706 0.168196
H  3.553329 -1.589108 1.239495
H  3.802148 -2.231985 -1.725463
H  5.756381 -0.966436 -0.82955
H  5.89643 -2.11872 0.501738
H  6.194475 -2.6338 -1.152441
H  2.880046 -4.192957 -0.501005
H  4.155291 -4.05563 0.707355
H  4.556085 -4.480068 -0.951586
H  1.439124 -1.367207 -1.887997
H  1.674566 -2.473614 2.239516
H  3.215904 2.547482 -0.105972
H  -0.926103 -2.005456 -1.9242
H  -0.698693 -3.117588 2.201073
H  0.147461 0.93499 1.392013
H  1.836944 3.126972 -1.891429
H  -0.357906 3.07939 -3.025834
H  -2.280834 1.962447 -1.975931
H  -2.952917 3.243494 0.765426
H  -4.235281 -0.733412 -0.159907
H  -5.282525 4.026065 0.641189
H  -6.580719 0.054218 -0.272765
H  -7.109156 2.440214 0.117817
totalener: -1706.63086256 hartree
nucrepener: 3030.11093293 hartree
electener: -4736.74179548 hartree
oneelecener: -8354.67283843 hartree
twoeener: 3617.93104295 hartree
kineticenergy: 1700.60901122 hartree
xcener: -142.767853953801 hartree
chargesum: 0.0000000
charge: -0.089052 -0.259926 -0.338807 -0.291821 0.001240 0.068706 0.064640 -0.036430 -0.275450 -0.282879 0.274549 -0.121577 -0.151931 0.328632 -0.187287 -0.130696 0.074636 0.148512 -0.237214 -0.123773 0.178235 -0.268667 -0.102123 -0.154472 0.211315 -0.136774 -0.184682 -0.128463 -0.120930 -0.128485 0.086985 0.044868 0.101555 0.080587 0.084107 0.100678 0.077825 0.091183 0.127850 0.108482 0.122695 0.117495 0.121828 0.122011 0.108809 0.129591 0.137037 0.134173 0.124086 0.127331 0.126027 0.125770
qa: -0.0891 -0.2599 -0.3388 -0.2918 0.0012 0.0687 0.0646 -0.0364 -0.2755 -0.2829 0.2745 -0.1216 -0.1519 0.3286 -0.1873 -0.1307 0.0746 0.1485 -0.2372 -0.1238 0.1782 -0.2687 -0.1021 -0.1545 0.2113 -0.1368 -0.1847 -0.1285 -0.1209 -0.1285 0.0870 0.0449 0.1016 0.0806 0.0841 0.1007 0.0778 0.0912 0.1279 0.1085 0.1227 0.1175 0.1218 0.1220 0.1088 0.1296 0.1370 0.1342 0.1241 0.1273 0.1260 0.1258
va: 1.2159 2.1473 2.1543 2.0676 3.1202 3.7727 3.8099 3.5334 3.9312 3.9497 4.2983 3.9175 4.0054 3.8278 4.0471 4.0655 3.5817 3.8352 4.0383 3.9987 3.8170 4.0400 3.9679 3.9621 3.8278 3.9421 3.9910 3.9580 3.9856 3.9441 1.0366 1.0271 1.0148 1.0037 1.0078 1.0033 1.0047 1.0079 1.0186 1.0122 1.0154 1.0163 1.0128 1.0280 1.0154 1.0005 1.0035 1.0033 1.0393 1.0000 1.0002 0.9999
dispcorr: -0.032500925 hartree
energy: -1706.663363484707
dipole: 17.45932 -17.58130 -0.12198 -5.63723 5.03766 -0.59957 -6.93932 5.88761 -1.05172
magnitude: 1.21675 au
magnitude: 3.09272 debye
