program: Orca
programVersion: 5.0.2
elementType: Cl O O O N C C C C C C C C C C C C C C C C C C C C C C C C C H H H H H H H H H H H H H H H H H H H H H H
charge: 0
multiplicity: 1
keywords: wb97x-d3
keywords: def2-TZVPP
keywords: def2/J RIJCOSX
keywords: DEFGRID2
keywords: scfconv7
keywords: smallprint printgap noloewdin
keywords: NOSOSCF
formula: C25H22ClNO3
InChI: InChI=1/C25H22ClNO3/c1-17(2)24(18-11-13-20(26)14-12-18)25(28)30-23(16-27)19-7-6-10-22(15-19)29-21-8-4-3-5-9-21/h3-15,17,23-24H,1-2H3
52 atoms
Cl -3.132841 -2.848278 1.757934
O  2.511607 0.826512 0.250725
O  2.514407 -0.131469 -1.778769
O  -2.387422 1.987849 0.713613
N  4.569339 3.445505 0.309042
C  2.532541 -1.520746 0.199721
C  3.189105 -2.677667 -0.572623
C  1.094111 -1.799396 0.585618
C  4.665576 -2.390388 -0.83018
C  3.034663 -3.987558 0.192062
C  2.540432 -0.228738 -0.585684
C  0.102713 -1.933716 -0.383386
C  0.741928 -1.95547 1.920069
C  2.401892 2.123968 -0.311774
C  -1.202442 -2.23863 -0.032389
C  -0.556786 -2.269559 2.287131
C  1.133008 2.804107 0.159404
C  -1.520802 -2.418454 1.304468
C  -0.034637 2.055935 0.245135
C  1.106966 4.166738 0.425722
C  -1.22636 2.684615 0.578163
C  3.614153 2.861972 0.052221
C  -0.088156 4.777213 0.773393
C  -1.260559 4.045686 0.843601
C  -2.8351 1.162114 -0.274464
C  -2.450936 1.278191 -1.605088
C  -3.76235 0.201418 0.10666
C  -2.995201 0.416227 -2.546297
C  -4.307242 -0.64139 -0.846859
C  -3.924762 -0.544123 -2.177583
H  3.10053 -1.356258 1.121504
H  2.681937 -2.777473 -1.536673
H  4.821379 -1.492334 -1.42667
H  5.21168 -2.271985 0.10871
H  5.126705 -3.217695 -1.370216
H  1.991556 -4.273187 0.321493
H  3.487213 -3.922841 1.184557
H  3.534247 -4.797033 -0.340795
H  0.341983 -1.803341 -1.431739
H  1.493878 -1.841617 2.690834
H  2.3832 2.051982 -1.404968
H  -1.964105 -2.330262 -0.793892
H  -0.814543 -2.399854 3.328949
H  -0.035439 0.987664 0.066024
H  2.011874 4.757642 0.373758
H  -0.104314 5.837244 0.987175
H  -2.197872 4.515534 1.109944
H  -1.742402 2.033981 -1.916284
H  -4.047333 0.11764 1.146636
H  -2.692917 0.510463 -3.581039
H  -5.026601 -1.389127 -0.541114
H  -4.350457 -1.206026 -2.919541
totalener: -1706.63147997 hartree
nucrepener: 3051.32206207 hartree
electener: -4757.95354204 hartree
oneelecener: -8396.63104567 hartree
twoeener: 3638.67750363 hartree
kineticenergy: 1700.59546873 hartree
xcener: -142.770445111315 hartree
chargesum: -0.0000000
charge: -0.078582 -0.261321 -0.343526 -0.293540 -0.001854 0.076239 0.061556 -0.103016 -0.273831 -0.284290 0.287903 -0.078664 -0.109587 0.326608 -0.224478 -0.143066 -0.028755 0.141451 -0.137201 -0.160241 0.211385 -0.256957 -0.094600 -0.178956 0.326658 -0.197841 -0.242623 -0.104086 -0.101081 -0.177820 0.085930 0.046585 0.103125 0.081886 0.084697 0.100780 0.078238 0.092179 0.131548 0.109319 0.132969 0.135220 0.121056 0.110796 0.127723 0.130913 0.129135 0.128322 0.128746 0.128819 0.128159 0.127972
qa: -0.0786 -0.2613 -0.3435 -0.2935 -0.0019 0.0762 0.0616 -0.1030 -0.2738 -0.2843 0.2879 -0.0787 -0.1096 0.3266 -0.2245 -0.1431 -0.0288 0.1415 -0.1372 -0.1602 0.2114 -0.2570 -0.0946 -0.1790 0.3267 -0.1978 -0.2426 -0.1041 -0.1011 -0.1778 0.0859 0.0466 0.1031 0.0819 0.0847 0.1008 0.0782 0.0922 0.1315 0.1093 0.1330 0.1352 0.1211 0.1108 0.1277 0.1309 0.1291 0.1283 0.1287 0.1288 0.1282 0.1280
va: 1.2326 2.1373 2.1521 2.1203 3.1117 3.7827 3.8085 3.5935 3.9319 3.9518 4.2657 3.8725 3.9976 3.8118 4.0411 4.0601 3.8356 3.8774 3.9298 3.9806 3.8598 4.0269 3.9704 4.0352 3.7245 3.9372 3.9364 3.9187 3.8646 3.9345 1.0372 1.0267 1.0144 1.0041 1.0071 1.0026 1.0049 1.0077 1.0229 1.0104 1.0248 1.0180 1.0138 1.0145 1.0217 1.0000 1.0111 1.0062 1.0214 0.9989 1.0073 1.0005
dispcorr: -0.033083094 hartree
energy: -1706.664563062320
dipole: 16.27715 -16.96252 -0.68538 -10.58764 9.94126 -0.64638 -8.86888 8.75028 -0.11860
magnitude: 0.94954 au
magnitude: 2.41353 debye
