program: Orca
programVersion: 5.0.2
elementType: O O O N C C C C C C C C C C C C C C C C C C C C C C H H H H H H H H H H H H H H H H H H H H H H H
charge: 0
multiplicity: 1
keywords: wb97x-d3
keywords: def2-TZVPP
keywords: def2/J RIJCOSX
keywords: DEFGRID2
keywords: scfconv7
keywords: smallprint printgap noloewdin
keywords: NOSOSCF
formula: C22H23NO3
InChI: InChI=1/C22H23NO3/c1-21(2)19(22(21,3)4)20(24)26-18(14-23)15-9-8-12-17(13-15)25-16-10-6-5-7-11-16/h5-13,18-19H,1-4H3
49 atoms
O  0.114123 2.716712 0.60031
O  0.616347 2.170845 -1.504539
O  -1.56528 -1.967258 1.148988
N  -2.466528 3.928599 2.248074
C  2.908621 0.638863 0.16663
C  3.559087 1.777017 -0.557101
C  2.289101 2.041833 0.229515
C  2.206768 -0.464808 -0.591084
C  3.498414 0.117743 1.457678
C  4.809265 2.407667 0.020001
C  3.588724 1.821142 -2.068997
C  0.973709 2.303304 -0.360208
C  -1.250077 2.800165 0.228189
C  -1.86185 1.443332 -0.045351
C  -1.915937 3.430815 1.369328
C  -1.433571 0.332071 0.670205
C  -2.843173 1.319375 -1.016427
C  -1.992559 -0.904611 0.396258
C  -3.407007 0.075144 -1.264672
C  -2.986506 -1.044198 -0.565143
C  -1.198551 -3.133732 0.524528
C  -1.436087 -4.313273 1.216216
C  -0.568649 -3.15067 -0.714198
C  -1.03649 -5.520832 0.662384
C  -0.182941 -4.367891 -1.258771
C  -0.414369 -5.555563 -0.578369
H  2.429826 2.539487 1.183136
H  2.931692 -1.228496 -0.879876
H  1.468079 -0.946796 0.052251
H  1.693602 -0.147052 -1.494388
H  3.930649 0.895369 2.083737
H  2.729782 -0.384942 2.047353
H  4.280811 -0.614692 1.247497
H  4.974906 3.387846 -0.431024
H  4.762955 2.554231 1.097404
H  5.68578 1.794254 -0.197645
H  2.806924 1.250602 -2.559764
H  3.524712 2.850402 -2.425259
H  4.544062 1.420071 -2.412931
H  -1.394251 3.457177 -0.635991
H  -0.666461 0.409559 1.431198
H  -3.164169 2.186344 -1.579635
H  -4.177843 -0.025918 -2.016578
H  -3.428097 -2.011896 -0.766611
H  -1.925742 -4.28442 2.18123
H  -0.370349 -2.232666 -1.252799
H  -1.222373 -6.43937 1.203268
H  0.30708 -4.381148 -2.223327
H  -0.110347 -6.499454 -1.010332
elementType: O N C H
totalener: -1132.68315735 hartree
nucrepener: 2293.33111302 hartree
electener: -3426.01427037 hartree
oneelecener: -6095.49134456 hartree
twoeener: 2669.47707419 hartree
cpcmener: -0.03412097 hartree
kineticenergy: 1127.65742662 hartree
xcener: -110.660798004140 hartree
chargesum: -0.0000000
charge: -0.289901 -0.463134 -0.342901 -0.102574 0.121960 0.121821 -0.120864 -0.315738 -0.282932 -0.292256 -0.302810 0.359418 0.414664 0.018291 -0.223159 -0.243730 -0.196978 0.232264 -0.129141 -0.160771 0.311661 -0.251821 -0.200104 -0.130633 -0.173774 -0.181977 0.091259 0.113448 0.085346 0.102098 0.093454 0.096561 0.100891 0.096602 0.093587 0.099937 0.093190 0.102336 0.096293 0.147704 0.143129 0.149693 0.164094 0.162572 0.148107 0.160403 0.161240 0.161706 0.161467
qa: -0.2899 -0.4631 -0.3429 -0.1026 0.1220 0.1218 -0.1209 -0.3157 -0.2829 -0.2923 -0.3028 0.3594 0.4147 0.0183 -0.2232 -0.2437 -0.1970 0.2323 -0.1291 -0.1608 0.3117 -0.2518 -0.2001 -0.1306 -0.1738 -0.1820 0.0913 0.1134 0.0853 0.1021 0.0935 0.0966 0.1009 0.0966 0.0936 0.0999 0.0932 0.1023 0.0963 0.1477 0.1431 0.1497 0.1641 0.1626 0.1481 0.1604 0.1612 0.1617 0.1615
va: 2.1028 2.0342 2.0445 3.1112 3.7216 3.7174 3.9088 3.9128 3.8981 3.9068 3.9003 4.1402 3.7098 3.6062 4.0825 4.0114 3.9863 3.7754 3.8894 3.9212 3.6278 4.0074 3.8673 3.8888 3.9240 3.8946 1.0312 1.0003 1.0011 1.0090 1.0049 1.0035 0.9986 1.0018 1.0047 0.9985 1.0100 0.9997 0.9985 1.0146 1.0227 1.0008 0.9885 0.9925 1.0078 0.9929 0.9880 0.9905 0.9889
dispcorr: -0.026566397 hartree
energy: -1132.709723743680
dipole: 27.90139 -26.58556 1.31584 -5.97508 4.61986 -1.35521 -7.07450 5.86149 -1.21301
magnitude: 2.24486 au
magnitude: 5.70599 debye
