program: Orca
programVersion: 5.0.2
elementType: O O O N C C C C C C C C C C C C C C C C C C C C C C H H H H H H H H H H H H H H H H H H H H H H H
charge: 0
multiplicity: 1
keywords: wb97x-d3
keywords: def2-TZVPP
keywords: def2/J RIJCOSX
keywords: DEFGRID2
keywords: scfconv7
keywords: smallprint printgap noloewdin
keywords: NOSOSCF
formula: C22H23NO3
InChI: InChI=1/C22H23NO3/c1-21(2)19(22(21,3)4)20(24)26-18(14-23)15-9-8-12-17(13-15)25-16-10-6-5-7-11-16/h5-13,18-19H,1-4H3
49 atoms
O  0.488078 1.717211 -0.753445
O  0.067522 3.142909 0.900231
O  -2.633993 -2.540887 0.334085
N  -1.702603 4.186974 -1.696044
C  2.87451 0.836147 1.050882
C  3.435404 1.735691 -0.005069
C  2.224014 2.20028 0.797164
C  2.150618 -0.441342 0.689969
C  3.578475 0.691724 2.38243
C  4.706008 2.511771 0.273024
C  3.34942 1.377159 -1.471811
C  0.844645 2.402445 0.341196
C  -0.87035 1.764885 -1.173364
C  -1.791995 0.983247 -0.265289
C  -1.320849 3.139364 -1.412669
C  -1.753443 -0.403417 -0.380211
C  -2.643797 1.588827 0.647933
C  -2.565782 -1.180073 0.433472
C  -3.45372 0.797791 1.451122
C  -3.414513 -0.582351 1.357588
C  -1.547331 -3.258747 -0.108381
C  -1.756601 -4.184313 -1.11878
C  -0.297819 -3.111617 0.47845
C  -0.698724 -4.976988 -1.543475
C  0.754149 -3.899318 0.034279
C  0.55923 -4.83397 -0.975002
H  2.458485 2.934352 1.560422
H  1.378112 -0.655218 1.430517
H  1.680307 -0.447207 -0.288366
H  2.859281 -1.27194 0.711306
H  4.005947 1.621837 2.750815
H  2.877875 0.334398 3.139491
H  4.383778 -0.042112 2.309853
H  4.786497 3.355422 -0.415068
H  4.75745 2.914369 1.282602
H  5.582279 1.878833 0.119539
H  4.287771 0.90705 -1.772866
H  2.551477 0.690231 -1.733545
H  3.229868 2.275089 -2.08031
H  -0.855737 1.285643 -2.155041
H  -1.105083 -0.862697 -1.117089
H  -2.694308 2.665329 0.738006
H  -4.119094 1.263377 2.165583
H  -4.046453 -1.196467 1.986298
H  -2.738689 -4.289332 -1.561879
H  -0.144817 -2.396098 1.276308
H  -0.862362 -5.70464 -2.327317
H  1.729743 -3.784791 0.48849
H  1.382128 -5.449787 -1.312328
elementType: O N C H
totalener: -1132.68017127 hartree
nucrepener: 2310.02401060 hartree
electener: -3442.70418188 hartree
oneelecener: -6128.46128155 hartree
twoeener: 2685.75709967 hartree
cpcmener: -0.03871960 hartree
kineticenergy: 1127.65623111 hartree
xcener: -110.663461233658 hartree
chargesum: 0.0000000
charge: -0.272187 -0.479625 -0.338842 -0.097535 0.124601 0.123220 -0.160948 -0.344277 -0.286016 -0.295905 -0.290542 0.442158 0.432170 -0.005632 -0.230967 -0.253869 -0.186056 0.292379 -0.138126 -0.229673 0.282109 -0.234957 -0.215319 -0.132283 -0.146485 -0.181958 0.087145 0.107887 0.098534 0.107501 0.094415 0.095970 0.099659 0.096939 0.093336 0.099388 0.095870 0.095114 0.101805 0.134209 0.149630 0.138079 0.161739 0.149367 0.149411 0.178821 0.161493 0.165840 0.162413
qa: -0.2722 -0.4796 -0.3388 -0.0975 0.1246 0.1232 -0.1609 -0.3443 -0.2860 -0.2959 -0.2905 0.4422 0.4322 -0.0056 -0.2310 -0.2539 -0.1861 0.2924 -0.1381 -0.2297 0.2821 -0.2350 -0.2153 -0.1323 -0.1465 -0.1820 0.0871 0.1079 0.0985 0.1075 0.0944 0.0960 0.0997 0.0969 0.0933 0.0994 0.0959 0.0951 0.1018 0.1342 0.1496 0.1381 0.1617 0.1494 0.1494 0.1788 0.1615 0.1658 0.1624
va: 2.1420 2.0227 2.0750 3.1072 3.7376 3.6810 3.9563 3.9249 3.9048 3.9118 3.9026 4.0812 3.8722 3.6466 4.0546 3.9442 3.9448 3.7162 3.9586 4.0102 3.6858 4.0047 3.9194 3.8795 3.8781 3.9091 1.0298 0.9960 0.9953 0.9979 1.0056 1.0016 0.9992 1.0014 1.0057 0.9986 0.9984 1.0063 1.0011 1.0019 1.0047 1.0216 0.9892 1.0052 1.0060 0.9838 0.9879 0.9887 0.9893
dispcorr: -0.027161635 hartree
energy: -1132.707332909238
dipole: 29.22458 -27.26324 1.96133 -4.26284 1.47037 -2.79247 4.43924 -4.53537 -0.09613
magnitude: 3.41379 au
magnitude: 8.67716 debye
