program: Orca
programVersion: 5.0.2
elementType: O O O N C C C C C C C C C C C C C C C C C C C C C C H H H H H H H H H H H H H H H H H H H H H H H
charge: 0
multiplicity: 1
keywords: wb97x-d3
keywords: def2-TZVPP
keywords: def2/J RIJCOSX
keywords: DEFGRID2
keywords: scfconv7
keywords: smallprint printgap noloewdin
keywords: NOSOSCF
formula: C22H23NO3
InChI: InChI=1/C22H23NO3/c1-21(2)19(22(21,3)4)20(24)26-18(14-23)15-9-8-12-17(13-15)25-16-10-6-5-7-11-16/h5-13,18-19H,1-4H3
49 atoms
O  0.382545 1.694108 -0.665001
O  -0.081597 2.212375 1.445288
O  -2.462778 -2.353817 0.43886
N  -1.339268 4.6116 -0.5234
C  2.788409 0.097367 0.348561
C  3.330373 1.484953 0.223874
C  2.027937 1.256007 0.995597
C  2.246937 -0.647536 -0.850369
C  3.41723 -0.87229 1.327573
C  4.507046 1.9171 1.07268
C  3.340584 2.204604 -1.105253
C  0.699559 1.760908 0.638603
C  -0.923191 2.080716 -1.043874
C  -2.008954 1.16299 -0.51464
C  -1.159957 3.491228 -0.711526
C  -1.699367 -0.173965 -0.287521
C  -3.303165 1.625322 -0.329889
C  -2.691413 -1.039933 0.150334
C  -4.2860 0.742523 0.099904
C  -3.991689 -0.586137 0.345452
C  -1.26928 -2.937722 0.068321
C  -1.011697 -3.214275 -1.266865
C  -0.368121 -3.289621 1.059786
C  0.168359 -3.859996 -1.6067
C  0.805801 -3.943874 0.707408
C  1.078161 -4.227483 -0.623399
H  2.150299 1.309104 2.071861
H  1.44012 -1.316971 -0.547689
H  1.875533 -0.023971 -1.656647
H  3.040811 -1.271793 -1.265854
H  3.696769 -0.415095 2.274572
H  2.719476 -1.681555 1.55185
H  4.313141 -1.323108 0.89567
H  4.478749 1.521983 2.08585
H  5.44466 1.596763 0.613788
H  4.534787 3.005548 1.149096
H  2.582899 1.882088 -1.812065
H  3.218871 3.279143 -0.957072
H  4.310271 2.052167 -1.583514
H  -0.91426 2.023603 -2.136052
H  -0.691888 -0.536397 -0.441786
H  -3.56038 2.660932 -0.511934
H  -5.296305 1.099473 0.248118
H  -4.758802 -1.268436 0.688828
H  -1.726315 -2.93499 -2.030926
H  -0.585426 -3.064925 2.096116
H  0.373039 -4.080221 -2.646067
H  1.509677 -4.226631 1.478892
H  1.994775 -4.734244 -0.894538
elementType: O N C H
totalener: -1132.68053148 hartree
nucrepener: 2357.60032099 hartree
electener: -3490.28085247 hartree
oneelecener: -6223.89413333 hartree
twoeener: 2733.61328086 hartree
cpcmener: -0.03950159 hartree
kineticenergy: 1127.65016794 hartree
xcener: -110.666246703895 hartree
chargesum: 0.0000000
charge: -0.284630 -0.472020 -0.335239 -0.095694 0.146317 0.101797 -0.131661 -0.275227 -0.302968 -0.290390 -0.293003 0.404134 0.465832 -0.060514 -0.235589 -0.197411 -0.224687 0.311938 -0.099698 -0.260297 0.237426 -0.163828 -0.163237 -0.150222 -0.185314 -0.149461 0.086395 0.015353 0.108797 0.115561 0.096978 0.093492 0.100625 0.092324 0.099822 0.096843 0.094044 0.102833 0.098539 0.144001 0.123211 0.135065 0.161826 0.147100 0.156855 0.150092 0.160729 0.162133 0.161028
qa: -0.2846 -0.4720 -0.3352 -0.0957 0.1463 0.1018 -0.1317 -0.2752 -0.3030 -0.2904 -0.2930 0.4041 0.4658 -0.0605 -0.2356 -0.1974 -0.2247 0.3119 -0.0997 -0.2603 0.2374 -0.1638 -0.1632 -0.1502 -0.1853 -0.1495 0.0864 0.0154 0.1088 0.1156 0.0970 0.0935 0.1006 0.0923 0.0998 0.0968 0.0940 0.1028 0.0985 0.1440 0.1232 0.1351 0.1618 0.1471 0.1569 0.1501 0.1607 0.1621 0.1610
va: 2.1257 2.0266 2.0793 3.1021 3.6127 3.7213 3.9411 3.8888 3.9194 3.9115 3.9044 4.0977 3.7993 3.8462 4.1078 3.9204 3.9567 3.7037 3.9102 4.0077 3.7160 3.9188 3.9193 3.8517 3.8499 3.8079 1.0301 1.0247 1.0171 0.9994 1.0070 1.0048 0.9989 1.0063 0.9987 1.0015 1.0124 0.9998 0.9982 0.9916 1.0110 1.0149 0.9881 1.0086 0.9965 1.0021 0.9893 0.9889 0.9902
dispcorr: -0.028948581 hartree
energy: -1132.709480060974
dipole: 28.40591 -26.61109 1.79482 -5.95295 3.45008 -2.50287 -0.93482 -0.57376 -1.50859
magnitude: 3.42951 au
magnitude: 8.71713 debye
