program: Orca
programVersion: 5.0.2
elementType: O O O N C C C C C C C C C C C C C C C C C C C C C C H H H H H H H H H H H H H H H H H H H H H H H
charge: 0
multiplicity: 1
keywords: wb97x-d3
keywords: def2-TZVPP
keywords: def2/J RIJCOSX
keywords: DEFGRID2
keywords: scfconv7
keywords: smallprint printgap noloewdin
keywords: NOSOSCF
formula: C22H23NO3
InChI: InChI=1/C22H23NO3/c1-21(2)19(22(21,3)4)20(24)26-18(14-23)15-9-8-12-17(13-15)25-16-10-6-5-7-11-16/h5-13,18-19H,1-4H3
49 atoms
O  0.494782 1.935357 0.438325
O  0.298116 3.182123 -1.394528
O  -1.986986 -2.385561 -1.114394
N  -1.282263 1.441954 3.170731
C  3.505609 1.88874 0.079886
C  3.075857 0.877957 -0.935683
C  2.414447 2.2601 -0.918672
C  3.224059 1.691058 1.553094
C  4.813012 2.630082 -0.109636
C  3.946074 0.591633 -2.139772
C  2.307793 -0.359738 -0.529913
C  0.991013 2.509606 -0.664912
C  -0.903045 2.070039 0.662022
C  -1.714766 1.161205 -0.229401
C  -1.095807 1.714903 2.069319
C  -1.460425 -0.205769 -0.217048
C  -2.686042 1.695436 -1.06219
C  -2.203673 -1.038007 -1.040258
C  -3.415339 0.849464 -1.886536
C  -3.182675 -0.515423 -1.87757
C  -1.558716 -3.079317 -0.007009
C  -2.149685 -2.90824 1.238838
C  -0.54975 -4.012056 -0.194259
C  -1.710358 -3.678749 2.305613
C  -0.1302 -4.78581 0.87938
C  -0.702269 -4.618794 2.132711
H  2.752886 2.906135 -1.721604
H  4.102216 1.240692 2.020129
H  3.056152 2.651572 2.043343
H  2.378461 1.050733 1.781625
H  5.652339 2.014893 0.220798
H  5.000795 2.925494 -1.140026
H  4.817044 3.540601 0.492555
H  4.741526 -0.108516 -1.875755
H  3.352242 0.129404 -2.930528
H  4.410338 1.480561 -2.561505
H  3.011314 -1.179738 -0.371442
H  1.722819 -0.261316 0.379031
H  1.629457 -0.66593 -1.328569
H  -1.227711 3.108219 0.542578
H  -0.691194 -0.613413 0.428489
H  -2.87231 2.761487 -1.068374
H  -4.174402 1.256076 -2.540959
H  -3.753249 -1.176446 -2.517262
H  -2.944532 -2.187032 1.381884
H  -0.103922 -4.137819 -1.172776
H  -2.166616 -3.544823 3.277637
H  0.652967 -5.51771 0.731743
H  -0.368631 -5.219042 2.968482
elementType: O N C H
totalener: -1132.68121137 hartree
nucrepener: 2305.60826969 hartree
electener: -3438.28948106 hartree
oneelecener: -6120.07259633 hartree
twoeener: 2681.78311527 hartree
cpcmener: -0.03441019 hartree
kineticenergy: 1127.65769794 hartree
xcener: -110.661162561568 hartree
chargesum: -0.0000000
charge: -0.269780 -0.482429 -0.339089 -0.100443 0.121532 0.122866 -0.155206 -0.287645 -0.296327 -0.286707 -0.317207 0.417586 0.385135 0.048569 -0.225372 -0.251118 -0.209716 0.274866 -0.110779 -0.243354 0.303848 -0.198037 -0.268643 -0.142530 -0.117025 -0.189391 0.086914 0.096469 0.102571 0.089484 0.099718 0.093067 0.096499 0.099065 0.096569 0.092293 0.106117 0.086868 0.105468 0.144649 0.164002 0.149584 0.162554 0.149994 0.157320 0.149159 0.163515 0.162083 0.162431
qa: -0.2698 -0.4824 -0.3391 -0.1004 0.1215 0.1229 -0.1552 -0.2876 -0.2963 -0.2867 -0.3172 0.4176 0.3851 0.0486 -0.2254 -0.2511 -0.2097 0.2749 -0.1108 -0.2434 0.3038 -0.1980 -0.2686 -0.1425 -0.1170 -0.1894 0.0869 0.0965 0.1026 0.0895 0.0997 0.0931 0.0965 0.0991 0.0966 0.0923 0.1061 0.0869 0.1055 0.1446 0.1640 0.1496 0.1626 0.1500 0.1573 0.1492 0.1635 0.1621 0.1624
va: 2.1357 2.0225 2.0706 3.1051 3.6774 3.6840 3.9244 3.9091 3.9122 3.9119 3.9227 4.1250 3.7835 3.5593 4.0726 3.9459 3.9621 3.7390 3.8909 4.0123 3.6518 3.9096 4.0007 3.8818 3.8669 3.9051 1.0294 0.9986 1.0010 1.0057 0.9987 1.0055 1.0014 0.9989 1.0014 1.0059 1.0004 1.0033 0.9957 1.0150 0.9863 1.0040 0.9877 1.0046 0.9973 1.0075 0.9887 0.9875 0.9891
dispcorr: -0.026542520 hartree
energy: -1132.707753891904
dipole: 27.04196 -25.96611 1.07585 0.40224 -0.88834 -0.48610 -2.64129 1.97226 -0.66903
magnitude: 1.35697 au
magnitude: 3.44913 debye
