program: Orca
programVersion: 5.0.2
elementType: O O O N C C C C C C C C C C C C C C C C C C C C C C H H H H H H H H H H H H H H H H H H H H H H H
charge: 0
multiplicity: 1
keywords: wb97x-d3
keywords: def2-TZVPP
keywords: def2/J RIJCOSX
keywords: DEFGRID2
keywords: scfconv7
keywords: smallprint printgap noloewdin
keywords: NOSOSCF
formula: C22H23NO3
InChI: InChI=1/C22H23NO3/c1-21(2)19(22(21,3)4)20(24)26-18(14-23)15-9-8-12-17(13-15)25-16-10-6-5-7-11-16/h5-13,18-19H,1-4H3
49 atoms
O  0.414297 1.888729 0.47619
O  0.443141 3.230047 -1.302185
O  -2.608792 -2.314992 -0.7495
N  -1.492571 1.687408 3.15453
C  3.412534 1.508714 0.278441
C  2.986517 0.729556 -0.926834
C  2.452375 2.149852 -0.71447
C  2.998542 1.080522 1.669006
C  4.793026 2.132436 0.310547
C  3.927248 0.549507 -2.09696
C  2.064088 -0.458785 -0.790208
C  1.028617 2.476831 -0.5579
C  -0.981216 2.129702 0.629932
C  -1.808999 1.23528 -0.260013
C  -1.254411 1.873195 2.044968
C  -1.78885 -0.142125 -0.056497
C  -2.557469 1.791873 -1.285296
C  -2.53023 -0.960536 -0.895798
C  -3.297779 0.958704 -2.114253
C  -3.283285 -0.411867 -1.93036
C  -1.667963 -2.979923 0.00648
C  -0.332551 -2.983338 -0.370586
C  -2.100941 -3.688659 1.115439
C  0.580993 -3.700273 0.387688
C  -1.178671 -4.414874 1.857643
C  0.162763 -4.417203 1.501863
H  2.915977 2.88027 -1.369145
H  2.070398 0.52127 1.725722
H  3.781908 0.443746 2.085643
H  2.9052 1.947226 2.325748
H  4.827846 2.924134 1.061536
H  5.543871 1.388331 0.584062
H  5.091628 2.576091 -0.637319
H  4.603564 -0.288553 -1.916032
H  3.361751 0.323893 -3.002996
H  4.533097 1.429054 -2.304481
H  1.384206 -0.417242 0.055425
H  1.460591 -0.573254 -1.693104
H  2.659182 -1.36814 -0.680491
H  -1.224777 3.179638 0.441792
H  -1.210329 -0.562262 0.758185
H  -2.5695 2.863294 -1.434935
H  -3.886513 1.381512 -2.917181
H  -3.858777 -1.060498 -2.578485
H  -0.008964 -2.435621 -1.24689
H  -3.147586 -3.678654 1.391619
H  1.62435 -3.701321 0.100467
H  -1.513186 -4.973901 2.721606
H  0.879205 -4.978461 2.086586
elementType: O N C H
totalener: -1132.68142322 hartree
nucrepener: 2326.00483248 hartree
electener: -3458.68625570 hartree
oneelecener: -6160.58338479 hartree
twoeener: 2701.89712909 hartree
cpcmener: -0.03443818 hartree
kineticenergy: 1127.65667898 hartree
xcener: -110.661142539636 hartree
chargesum: 0.0000000
charge: -0.265828 -0.484228 -0.337314 -0.100616 0.131363 0.123157 -0.173599 -0.288932 -0.295999 -0.284259 -0.330600 0.430404 0.379152 0.039026 -0.225038 -0.259408 -0.203179 0.294565 -0.113426 -0.242803 0.270976 -0.216704 -0.211960 -0.151019 -0.143900 -0.170542 0.090373 0.089712 0.096852 0.101973 0.096151 0.099051 0.093545 0.098936 0.096231 0.093340 0.081141 0.109492 0.111528 0.143557 0.150388 0.148699 0.161863 0.149019 0.179502 0.149641 0.165639 0.162194 0.161883
qa: -0.2658 -0.4842 -0.3373 -0.1006 0.1314 0.1232 -0.1736 -0.2889 -0.2960 -0.2843 -0.3306 0.4304 0.3792 0.0390 -0.2250 -0.2594 -0.2032 0.2946 -0.1134 -0.2428 0.2710 -0.2167 -0.2120 -0.1510 -0.1439 -0.1705 0.0904 0.0897 0.0969 0.1020 0.0962 0.0991 0.0935 0.0989 0.0962 0.0933 0.0811 0.1095 0.1115 0.1436 0.1504 0.1487 0.1619 0.1490 0.1795 0.1496 0.1656 0.1622 0.1619
va: 2.1381 2.0185 2.0798 3.1070 3.6732 3.7545 3.9389 3.9065 3.9099 3.9031 3.9307 4.1152 3.7706 3.5876 4.0741 3.9400 3.9660 3.7437 3.9063 4.0071 3.6794 3.9226 3.9969 3.8783 3.8839 3.9071 1.0292 1.0027 0.9991 1.0014 1.0018 0.9987 1.0052 0.9994 1.0021 1.0057 0.9891 0.9961 0.9964 1.0159 1.0044 1.0081 0.9880 1.0061 0.9826 1.0043 0.9891 0.9879 0.9893
dispcorr: -0.027742534 hartree
energy: -1132.709165748917
dipole: 28.25562 -26.82515 1.43047 -1.97776 1.17870 -0.79907 -3.43805 2.49588 -0.94217
magnitude: 1.89009 au
magnitude: 4.80423 debye
