program: Orca
programVersion: 5.0.2
elementType: O O O N C C C C C C C C C C C C C C C C C C C C C C H H H H H H H H H H H H H H H H H H H H H H H
charge: 0
multiplicity: 1
keywords: wb97x-d3
keywords: def2-TZVPP
keywords: def2/J RIJCOSX
keywords: DEFGRID2
keywords: scfconv7
keywords: smallprint printgap noloewdin
keywords: NOSOSCF
formula: C22H23NO3
InChI: InChI=1/C22H23NO3/c1-21(2)19(22(21,3)4)20(24)26-18(14-23)15-9-8-12-17(13-15)25-16-10-6-5-7-11-16/h5-13,18-19H,1-4H3
49 atoms
O  0.293948 1.813435 -0.110868
O  1.107402 3.732128 0.664741
O  -2.701127 -2.334218 -0.412226
N  -1.508062 2.446697 2.691627
C  3.206403 0.806911 0.438842
C  3.015232 0.952798 -1.038557
C  2.640128 2.114212 -0.125291
C  2.331596 -0.123891 1.247436
C  4.59025 0.903683 1.042442
C  4.215037 1.211476 -1.927096
C  1.99085 0.117825 -1.776385
C  1.304667 2.637095 0.186814
C  -1.031871 2.262534 0.123964
C  -1.95477 1.254402 -0.511343
C  -1.278355 2.37054 1.566915
C  -1.895268 -0.07558 -0.107357
C  -2.813953 1.653525 -1.522314
C  -2.689024 -1.011947 -0.751418
C  -3.62125 0.706505 -2.140081
C  -3.557071 -0.624043 -1.76749
C  -1.593454 -2.903924 0.174183
C  -0.337846 -2.810774 -0.412396
C  -1.784958 -3.626732 1.340625
C  0.737715 -3.444582 0.192156
C  -0.702536 -4.269359 1.926674
C  0.560921 -4.175601 1.360508
H  3.357512 2.927955 -0.120936
H  1.328759 -0.270431 0.857137
H  2.803138 -1.107373 1.30148
H  2.234794 0.244496 2.270451
H  4.52255 1.171483 2.098391
H  5.100002 -0.059963 0.979858
H  5.222091 1.646692 0.560111
H  3.887913 1.61961 -2.885257
H  4.926644 1.917701 -1.503958
H  4.747797 0.280859 -2.132286
H  1.164479 -0.243124 -1.173328
H  1.57261 0.673072 -2.617546
H  2.492092 -0.760406 -2.188483
H  -1.198989 3.251155 -0.313797
H  -1.2311 -0.371237 0.696696
H  -2.848921 2.689791 -1.831945
H  -4.294236 1.006197 -2.931885
H  -4.174672 -1.364527 -2.259555
H  -0.195902 -2.252722 -1.329574
H  -2.771234 -3.690626 1.782094
H  1.718122 -3.369639 -0.259704
H  -0.850926 -4.83847 2.834796
H  1.403007 -4.672045 1.823744
elementType: O N C H
totalener: -1132.68246832 hartree
nucrepener: 2331.88337670 hartree
electener: -3464.56584501 hartree
oneelecener: -6172.04914876 hartree
twoeener: 2707.48330375 hartree
cpcmener: -0.03798213 hartree
kineticenergy: 1127.65908641 hartree
xcener: -110.661631287834 hartree
chargesum: 0.0000000
charge: -0.258867 -0.483209 -0.337380 -0.098573 0.117054 0.137656 -0.166901 -0.274414 -0.287569 -0.297116 -0.246406 0.425321 0.386788 0.015704 -0.219500 -0.249406 -0.199645 0.282554 -0.112303 -0.241225 0.286372 -0.202706 -0.234367 -0.174979 -0.132851 -0.160699 0.087865 0.053010 0.101465 0.107981 0.096496 0.099340 0.092075 0.096983 0.093264 0.099593 0.028704 0.105782 0.099127 0.131273 0.161294 0.150716 0.162151 0.149901 0.172713 0.148996 0.164847 0.161567 0.161523
qa: -0.2589 -0.4832 -0.3374 -0.0986 0.1171 0.1377 -0.1669 -0.2744 -0.2876 -0.2971 -0.2464 0.4253 0.3868 0.0157 -0.2195 -0.2494 -0.1996 0.2826 -0.1123 -0.2412 0.2864 -0.2027 -0.2344 -0.1750 -0.1329 -0.1607 0.0879 0.0530 0.1015 0.1080 0.0965 0.0993 0.0921 0.0970 0.0933 0.0996 0.0287 0.1058 0.0991 0.1313 0.1613 0.1507 0.1622 0.1499 0.1727 0.1490 0.1648 0.1616 0.1615
va: 2.1652 2.0178 2.0801 3.1070 3.6970 3.6775 3.9460 3.9270 3.9105 3.9115 3.9109 4.1068 3.7823 3.6789 4.0212 3.9231 3.9444 3.7532 3.8972 4.0092 3.6751 3.8801 4.0084 3.8597 3.8833 3.8830 1.0296 1.0011 0.9982 1.0051 1.0017 0.9988 1.0056 1.0014 1.0058 0.9985 1.0033 1.0060 1.0002 1.0223 0.9985 0.9998 0.9881 1.0055 0.9838 1.0060 0.9893 0.9876 0.9889
dispcorr: -0.028186089 hartree
energy: -1132.710654405394
dipole: 26.90028 -25.83267 1.06761 -5.60355 4.06857 -1.53498 -6.16937 3.85867 -2.31071
magnitude: 2.97242 au
magnitude: 7.55530 debye
