program: Orca
programVersion: 5.0.2
elementType: O O O N C C C C C C C C C C C C C C C C C C C C C C H H H H H H H H H H H H H H H H H H H H H H H
charge: 0
multiplicity: 1
keywords: wb97x-d3
keywords: def2-TZVPP
keywords: def2/J RIJCOSX
keywords: DEFGRID2
keywords: scfconv7
keywords: smallprint printgap noloewdin
keywords: NOSOSCF
formula: C22H23NO3
InChI: InChI=1/C22H23NO3/c1-21(2)19(22(21,3)4)20(24)26-18(14-23)15-9-8-12-17(13-15)25-16-10-6-5-7-11-16/h5-13,18-19H,1-4H3
49 atoms
O  0.280452 1.810029 -0.11417
O  1.116395 3.751477 0.579411
O  -2.712305 -2.315339 -0.329012
N  -1.541503 2.603122 2.635069
C  3.169033 0.777057 0.502915
C  3.012292 0.883891 -0.981768
C  2.633188 2.075529 -0.109084
C  2.268484 -0.1266 1.314465
C  4.5402 0.877186 1.134642
C  4.235157 1.100482 -1.849621
C  1.990175 0.045214 -1.71809
C  1.300613 2.631747 0.154843
C  -1.040373 2.28947 0.084818
C  -1.974325 1.269938 -0.515298
C  -1.302717 2.467616 1.517921
C  -1.906569 -0.051692 -0.087504
C  -2.85626 1.650328 -1.514139
C  -2.712687 -1.000153 -0.697546
C  -3.677044 0.692214 -2.095683
C  -3.602755 -0.631889 -1.701133
C  -1.564738 -2.883171 0.176104
C  -0.347148 -2.763292 -0.482007
C  -1.677268 -3.629433 1.338671
C  0.771175 -3.389419 0.048452
C  -0.553364 -4.265853 1.84874
C  0.67403 -4.142046 1.212698
H  3.363159 2.877973 -0.112082
H  1.277106 -0.2859 0.899627
H  2.737264 -1.108411 1.411979
H  2.142353 0.27278 2.322711
H  5.052282 -0.086215 1.090842
H  5.181238 1.617967 0.660742
H  4.44924 1.153527 2.186699
H  4.750094 0.154146 -2.0271
H  3.938321 1.498634 -2.82173
H  4.954896 1.796558 -1.423329
H  1.130211 -0.257727 -1.130935
H  1.62103 0.57317 -2.599349
H  2.476184 -0.867946 -2.069717
H  -1.187007 3.259983 -0.398357
H  -1.225789 -0.332399 0.70805
H  -2.89782 2.680738 -1.842256
H  -4.367512 0.977274 -2.877797
H  -4.228878 -1.381988 -2.167086
H  -0.266332 -2.188767 -1.396504
H  -2.634998 -3.715329 1.836208
H  1.722879 -3.289089 -0.457317
H  -0.640562 -4.852439 2.753992
H  1.54907 -4.631939 1.61843
elementType: O N C H
totalener: -1132.68254347 hartree
nucrepener: 2335.81988423 hartree
electener: -3468.50242769 hartree
oneelecener: -6179.86189861 hartree
twoeener: 2711.35947092 hartree
cpcmener: -0.03809318 hartree
kineticenergy: 1127.64960478 hartree
xcener: -110.660330374496 hartree
chargesum: 0.0000000
charge: -0.259571 -0.484417 -0.338007 -0.098449 0.124310 0.140283 -0.170147 -0.277162 -0.288619 -0.294861 -0.252284 0.428483 0.383616 0.018411 -0.217962 -0.244609 -0.197707 0.273378 -0.114807 -0.237537 0.288940 -0.201514 -0.241918 -0.168424 -0.126194 -0.171457 0.087678 0.050751 0.101327 0.108770 0.099555 0.092294 0.096341 0.099540 0.096783 0.093034 0.025191 0.107344 0.100707 0.130900 0.166047 0.150914 0.162069 0.150209 0.171740 0.148797 0.164797 0.161862 0.161577
qa: -0.2596 -0.4844 -0.3380 -0.0984 0.1243 0.1403 -0.1701 -0.2772 -0.2886 -0.2949 -0.2523 0.4285 0.3836 0.0184 -0.2180 -0.2446 -0.1977 0.2734 -0.1148 -0.2375 0.2889 -0.2015 -0.2419 -0.1684 -0.1262 -0.1715 0.0877 0.0508 0.1013 0.1088 0.0996 0.0923 0.0963 0.0995 0.0968 0.0930 0.0252 0.1073 0.1007 0.1309 0.1660 0.1509 0.1621 0.1502 0.1717 0.1488 0.1648 0.1619 0.1616
va: 2.1660 2.0169 2.0796 3.1069 3.6872 3.6764 3.9481 3.9299 3.9113 3.9098 3.9137 4.1047 3.7876 3.6740 4.0197 3.9206 3.9440 3.7573 3.8969 4.0083 3.6793 3.8713 4.0122 3.8494 3.8783 3.8883 1.0299 0.9999 0.9981 1.0054 0.9987 1.0056 1.0017 0.9987 1.0017 1.0058 1.0015 1.0066 0.9987 1.0227 0.9955 0.9997 0.9881 1.0050 0.9837 1.0064 0.9898 0.9872 0.9891
dispcorr: -0.028450806 hartree
energy: -1132.710994271654
dipole: 26.89297 -25.82078 1.07219 -6.23044 4.60164 -1.62879 -5.71517 3.43104 -2.28413
magnitude: 3.00330 au
magnitude: 7.63379 debye
